httpd-dev mailing list archives

Site index · List index
Message view « Date » · « Thread »
Top « Date » · « Thread »
From r..@covalent.net
Subject Re: apache 2.0 RPM - next
Date Mon, 29 Jan 2001 17:14:14 GMT

This has been fixed this morning.  Update and try again please.  :-)

Ryan

On Mon, 29 Jan 2001, Gomez Henri wrote:

> Hi,
> 
> Just a note to say that when trying tp rebuild with latest stuff from CVS,
> compile is broken :
> 
> mpm/dexter -I/usr/src/redhat/BUILD/httpd-2.0/include -I/usr/src/redhat/BUILD
> /httpd-2.0/srclib/apr/include -I/usr/src/redhat/BUILD/httpd-2.0/srclib/apr-u
> til/include -I/usr/src/redhat/BUILD/httpd-2.0/modules/dav/main -I/usr/src/re
> dhat/BUILD/httpd-2.0/os/unix -I/usr/src/redhat/BUILD/httpd-2.0/srclib/expat-
> lite  -D_REENTRANT -DLINUX=2 -pthread -pthread  -c util_filter.c && touch
> util_filter.lo
> gawk -f /usr/src/redhat/BUILD/httpd-2.0/srclib/apr/helpers/make_export.awk
> /usr/src/redhat/BUILD/httpd-2.0/include/*.h > apache.exports
> (cat ../srclib/apr/apr.exports ../srclib/apr-util/aprutil.exports
> apache.exports | ../build/buildexports.sh ..) > exports.c
> /bin/sh /usr/src/redhat/BUILD/httpd-2.0/libtool --silent --mode=compile
> cc  -I. -I/usr/src/redhat/BUILD/httpd-2.0/server -I/usr/src/redhat/BUILD/htt
> pd-2.0/server/mpm/dexter -I/usr/src/redhat/BUILD/httpd-2.0/include -I/usr/sr
> c/redhat/BUILD/httpd-2.0/srclib/apr/include -I/usr/src/redhat/BUILD/httpd-2.
> 0/srclib/apr-util/include -I/usr/src/redhat/BUILD/httpd-2.0/modules/dav/main
>  -I/usr/src/redhat/BUILD/httpd-2.0/os/unix -I/usr/src/redhat/BUILD/httpd-2.0
> /srclib/expat-lite  -D_REENTRANT -DLINUX=2 -pthread -pthread  -c exports.c
> && touch exports.lo
> exports.c:339: `apr_compare_users' undeclared here (not in a function)
> exports.c:342: `apr_compare_groups' undeclared here (not in a function)
> make[2]: *** [exports.lo] Error 1
> make[2]: Leaving directory `/usr/src/redhat/BUILD/httpd-2.0/server'
> make[1]: *** [all-recursive] Error 1
> make[1]: Leaving directory `/usr/src/redhat/BUILD/httpd-2.0/server'
> make: *** [all-recursive] Error 1
> Bad exit status from /var/tmp/rpm-tmp.23398 (%build)
> 
> 


_______________________________________________________________________________
Ryan Bloom                        	rbb@apache.org
406 29th St.
San Francisco, CA 94131
-------------------------------------------------------------------------------


Mime
View raw message