httpd-bugs mailing list archives

Site index · List index
Message view « Date » · « Thread »
Top « Date » · « Thread »
From bugzi...@apache.org
Subject [Bug 57035] New: httpd-2.2.29 compile error (mod_deflate) with openssl 1.0.1h or i
Date Mon, 29 Sep 2014 02:26:08 GMT
https://issues.apache.org/bugzilla/show_bug.cgi?id=57035

            Bug ID: 57035
           Summary: httpd-2.2.29 compile error (mod_deflate) with openssl
                    1.0.1h or i
           Product: Apache httpd-2
           Version: 2.2.29
          Hardware: All
                OS: Linux
            Status: NEW
          Severity: normal
          Priority: P2
         Component: Build
          Assignee: bugs@httpd.apache.org
          Reporter: z_zori@naver.com

OS : CentOS release 5.10 (Final)
openssl : 1.0.1h, 1.0.1i, install /usr/local/openssl

configure :
./configure --prefix=/usr/local/apache2 --enable-mods-shared=most --enable-ssl
--with-ssl=/usr/local/openssl --enable-unique-id

............
/usr/lib64/apr-1/build/libtool --silent --mode=compile gcc -pthread   
-DLINUX=2 -D_REENTRANT -D_GNU_SOURCE  -I/usr/local/openssl/include/openssl 
-I/root/archive/httpd-2.2.29/srclib/pcre -I.
-I/root/archive/httpd-2.2.29/os/unix
-I/root/archive/httpd-2.2.29/server/mpm/prefork
-I/root/archive/httpd-2.2.29/modules/http
-I/root/archive/httpd-2.2.29/modules/filters
-I/root/archive/httpd-2.2.29/modules/proxy -I/root/archive/httpd-2.2.29/include
-I/root/archive/httpd-2.2.29/modules/generators
-I/root/archive/httpd-2.2.29/modules/mappers
-I/root/archive/httpd-2.2.29/modules/database -I/usr/include/apr-1
-I/root/archive/httpd-2.2.29/modules/proxy/../generators
-I/usr/local/openssl/include -I/root/archive/httpd-2.2.29/modules/ssl
-I/root/archive/httpd-2.2.29/modules/dav/main -prefer-pic -c mod_deflate.c &&
touch mod_deflate.slo
mod_deflate.c: In function 'deflate_out_filter':
mod_deflate.c:790: error: 'APR_INT32_MAX' undeclared (first use in this
function)
mod_deflate.c:790: error: (Each undeclared identifier is reported only once
mod_deflate.c:790: error: for each function it appears in.)
mod_deflate.c: In function 'deflate_in_filter':
mod_deflate.c:1165: error: 'APR_INT32_MAX' undeclared (first use in this
function)
mod_deflate.c: In function 'inflate_out_filter':
mod_deflate.c:1550: error: 'APR_INT32_MAX' undeclared (first use in this
function)
make[4]: *** [mod_deflate.slo] Error 1
make[4]: Leaving directory `/root/archive/httpd-2.2.29/modules/filters'
make[3]: *** [shared-build-recursive] Error 1
make[3]: Leaving directory `/root/archive/httpd-2.2.29/modules/filters'
make[2]: *** [shared-build-recursive] Error 1
make[2]: Leaving directory `/root/archive/httpd-2.2.29/modules'
make[1]: *** [shared-build-recursive] Error 1
make[1]: Leaving directory `/root/archive/httpd-2.2.29'
make: *** [all-recursive] Error 1
[root@sms httpd-2.2.29]#

-- 
You are receiving this mail because:
You are the assignee for the bug.

---------------------------------------------------------------------
To unsubscribe, e-mail: bugs-unsubscribe@httpd.apache.org
For additional commands, e-mail: bugs-help@httpd.apache.org


Mime
View raw message