httpd-bugs mailing list archives

Site index · List index
Message view « Date » · « Thread »
Top « Date » · « Thread »
From bugzi...@apache.org
Subject [Bug 55789] compile fails in server/exports.c at line 445 with error: undefined symbol: ap_condition_if_match
Date Tue, 19 Nov 2013 20:56:34 GMT
https://issues.apache.org/bugzilla/show_bug.cgi?id=55789

--- Comment #10 from Dennis Clarke <dclarke@blastwave.org> ---
My method, while hardly elegant, is working slowly. 

I have reached this point : 

/usr/local/build-1/libtool --silent --mode=compile
/opt/solarisstudio12.3/bin/cc -D_STDC_C99=    -errfmt=error -erroff=%none
-errshort=full -xstrconst -xildoff -m64 -xmemalign=8s -xnolibmil -Xa
-xcode=pic32 -xregs=no%appl -xlibmieee -mc -g -xs -ftrap=%none -Qy
-xbuiltin=%none -xdebugformat=dwarf -xunroll=1 -xtarget=ultraT2
-xcache=8/16/4:4096/64/16 -D_TS_ERRNO -D_POSIX_PTHREAD_SEMANTICS
-D_LARGEFILE64_SOURCE    -DSOLARIS2=10 -D_REENTRANT  -I/usr/local/include
-I/usr/local/ssl/include -D_TS_ERRNO -D_POSIX_PTHREAD_SEMANTICS
-D_LARGEFILE64_SOURCE   -I.
-I/usr/local/build/httpd-2.4.6_SunOS5.10_sparcv9.002/os/unix
-I/usr/local/build/httpd-2.4.6_SunOS5.10_sparcv9.002/include
-I/usr/local/include/apr-1 -I/usr/local/ssl/include -I/usr/local/include
-I/usr/local/build/httpd-2.4.6_SunOS5.10_sparcv9.002/modules/aaa
-I/usr/local/build/httpd-2.4.6_SunOS5.10_sparcv9.002/modules/cache
-I/usr/local/build/httpd-2.4.6_SunOS5.10_sparcv9.002/modules/core
-I/usr/local/build/httpd-2.4.6_SunOS5.10_sparcv9.002/modules/database
-I/usr/local/build/httpd-2.4.6_SunOS5.10_sparcv9.002/modules/filters
-I/usr/local/build/httpd-2.4.6_SunOS5.10_sparcv9.002/modules/ldap
-I/usr/local/build/httpd-2.4.6_SunOS5.10_sparcv9.002/server
-I/usr/local/build/httpd-2.4.6_SunOS5.10_sparcv9.002/modules/loggers
-I/usr/local/build/httpd-2.4.6_SunOS5.10_sparcv9.002/modules/lua
-I/usr/local/build/httpd-2.4.6_SunOS5.10_sparcv9.002/modules/proxy
-I/usr/local/build/httpd-2.4.6_SunOS5.10_sparcv9.002/modules/session
-I/usr/local/build/httpd-2.4.6_SunOS5.10_sparcv9.002/modules/ssl
-I/usr/local/build/httpd-2.4.6_SunOS5.10_sparcv9.002/modules/test
-I/usr/local/build/httpd-2.4.6_SunOS5.10_sparcv9.002/server
-I/usr/local/build/httpd-2.4.6_SunOS5.10_sparcv9.002/modules/arch/unix
-I/usr/local/build/httpd-2.4.6_SunOS5.10_sparcv9.002/modules/dav/main
-I/usr/local/build/httpd-2.4.6_SunOS5.10_sparcv9.002/modules/generators
-I/usr/local/build/httpd-2.4.6_SunOS5.10_sparcv9.002/modules/mappers
-prefer-pic -c mod_lbmethod_heartbeat.c && touch mod_lbmethod_heartbeat.slo
"mod_lbmethod_heartbeat.c", line 410: error: undefined symbol:
DEFAULT_HEARTBEAT_STORAGE
"mod_lbmethod_heartbeat.c", line 410: warning: improper pointer/integer
combination: arg #2
cc: acomp failed for mod_lbmethod_heartbeat.c
gmake[4]: *** [mod_lbmethod_heartbeat.slo] Error 1
gmake[4]: Leaving directory
`/usr/local/build/httpd-2.4.6_SunOS5.10_sparcv9.002/modules/proxy/balancers'
gmake[3]: *** [shared-build-recursive] Error 1
gmake[3]: Leaving directory
`/usr/local/build/httpd-2.4.6_SunOS5.10_sparcv9.002/modules/proxy/balancers'
gmake[2]: *** [shared-build-recursive] Error 1
gmake[2]: Leaving directory
`/usr/local/build/httpd-2.4.6_SunOS5.10_sparcv9.002/modules'
gmake[1]: *** [shared-build-recursive] Error 1
gmake[1]: Leaving directory
`/usr/local/build/httpd-2.4.6_SunOS5.10_sparcv9.002'
gmake: *** [all-recursive] Error 1


node002$ find . -type f | xargs grep "DEFAULT_HEARTBEAT_STORAGE" | cut -f1 -d\: 
./modules/cluster/mod_heartmonitor.c
./modules/proxy/balancers/mod_lbmethod_heartbeat.c
./include/heartbeat.h

node002$ ls -lap /usr/local/include/heartbeat.h 
-rw-r--r--   1 dclarke  adbs        1399 Feb 28  2013
/usr/local/include/heartbeat.h


So I move that aside : 


node002$ mv /usr/local/include/heartbeat.h /usr/local/include/heartbeat.h_2.4.4

The building continues. 

Really I need to go through this from top to bottom again and check the
build/config_vars.mk for an offending EXTRA_INCLUDES.

I think this is a valid build bug however.

-- 
You are receiving this mail because:
You are the assignee for the bug.

---------------------------------------------------------------------
To unsubscribe, e-mail: bugs-unsubscribe@httpd.apache.org
For additional commands, e-mail: bugs-help@httpd.apache.org


Mime
View raw message