httpd-bugs mailing list archives

Site index · List index
Message view « Date » · « Thread »
Top « Date » · « Thread »
From bugzi...@apache.org
Subject [Bug 53614] New: make install bad status fail
Date Fri, 27 Jul 2012 20:55:01 GMT
https://issues.apache.org/bugzilla/show_bug.cgi?id=53614

          Priority: P2
            Bug ID: 53614
          Assignee: bugs@httpd.apache.org
           Summary: make install bad status fail
          Severity: normal
    Classification: Unclassified
                OS: AIX
          Reporter: dementor92337@gmail.com
          Hardware: PC
            Status: NEW
           Version: 2.5-HEAD
         Component: Build
           Product: Apache httpd-2

Hi,

When I run make install, I get these outputs and then it fails:

Making install in aaa
make[2]: Entering directory `/home/guest/httpd-2.4.2/modules/aaa'
make[3]: Entering directory `/home/guest/httpd-2.4.2/modules/aaa'
rm -f /usr/local/apache2/modules/mod_authn_file.so
/home/guest/httpd-2.4.2/srclib/apr/libtool --silent --mode=install install
mod_authn_file.la /usr/local/apache2/modules/
find: bad status-- /usr/local/apache2/modules/mod_authn_file.so
install: File mod_authn_file.so was not found.
rm -f /usr/local/apache2/modules/mod_authn_dbm.so
/home/guest/httpd-2.4.2/srclib/apr/libtool --silent --mode=install install
mod_authn_dbm.la /usr/local/apache2/modules/
find: bad status-- /usr/local/apache2/modules/mod_authn_dbm.so
install: File mod_authn_dbm.so was not found.
rm -f /usr/local/apache2/modules/mod_authn_anon.so
/home/guest/httpd-2.4.2/srclib/apr/libtool --silent --mode=install install
mod_authn_anon.la /usr/local/apache2/modules/
find: bad status-- /usr/local/apache2/modules/mod_authn_anon.so
install: File mod_authn_anon.so was not found.
rm -f /usr/local/apache2/modules/mod_authn_dbd.so
/home/guest/httpd-2.4.2/srclib/apr/libtool --silent --mode=install install
mod_authn_dbd.la /usr/local/apache2/modules/
find: bad status-- /usr/local/apache2/modules/mod_authn_dbd.so
install: File mod_authn_dbd.so was not found.
rm -f /usr/local/apache2/modules/mod_authn_socache.so
/home/guest/httpd-2.4.2/srclib/apr/libtool --silent --mode=install install
mod_authn_socache.la /usr/local/apache2/modules/
find: bad status-- /usr/local/apache2/modules/mod_authn_socache.so
install: File mod_authn_socache.so was not found.
rm -f /usr/local/apache2/modules/mod_authn_core.so
/home/guest/httpd-2.4.2/srclib/apr/libtool --silent --mode=install install
mod_authn_core.la /usr/local/apache2/modules/
find: bad status-- /usr/local/apache2/modules/mod_authn_core.so
install: File mod_authn_core.so was not found.
rm -f /usr/local/apache2/modules/mod_authz_host.so
/home/guest/httpd-2.4.2/srclib/apr/libtool --silent --mode=install install
mod_authz_host.la /usr/local/apache2/modules/
find: bad status-- /usr/local/apache2/modules/mod_authz_host.so
install: File mod_authz_host.so was not found.
rm -f /usr/local/apache2/modules/mod_authz_groupfile.so
/home/guest/httpd-2.4.2/srclib/apr/libtool --silent --mode=install install
mod_authz_groupfile.la /usr/local/apache2/modules/
find: bad status-- /usr/local/apache2/modules/mod_authz_groupfile.so
install: File mod_authz_groupfile.so was not found.
rm -f /usr/local/apache2/modules/mod_authz_user.so
/home/guest/httpd-2.4.2/srclib/apr/libtool --silent --mode=install install
mod_authz_user.la /usr/local/apache2/modules/
find: bad status-- /usr/local/apache2/modules/mod_authz_user.so
install: File mod_authz_user.so was not found.
rm -f /usr/local/apache2/modules/mod_authz_dbm.so
/home/guest/httpd-2.4.2/srclib/apr/libtool --silent --mode=install install
mod_authz_dbm.la /usr/local/apache2/modules/
find: bad status-- /usr/local/apache2/modules/mod_authz_dbm.so
install: File mod_authz_dbm.so was not found.
rm -f /usr/local/apache2/modules/mod_authz_owner.so
/home/guest/httpd-2.4.2/srclib/apr/libtool --silent --mode=install install
mod_authz_owner.la /usr/local/apache2/modules/
find: bad status-- /usr/local/apache2/modules/mod_authz_owner.so
install: File mod_authz_owner.so was not found.
rm -f /usr/local/apache2/modules/mod_authz_dbd.so
/home/guest/httpd-2.4.2/srclib/apr/libtool --silent --mode=install install
mod_authz_dbd.la /usr/local/apache2/modules/
find: bad status-- /usr/local/apache2/modules/mod_authz_dbd.so
install: File mod_authz_dbd.so was not found.
rm -f /usr/local/apache2/modules/mod_authz_core.so
/home/guest/httpd-2.4.2/srclib/apr/libtool --silent --mode=install install
mod_authz_core.la /usr/local/apache2/modules/
find: bad status-- /usr/local/apache2/modules/mod_authz_core.so
install: File mod_authz_core.so was not found.
rm -f /usr/local/apache2/modules/mod_access_compat.so
/home/guest/httpd-2.4.2/srclib/apr/libtool --silent --mode=install install
mod_access_compat.la /usr/local/apache2/modules/
find: bad status-- /usr/local/apache2/modules/mod_access_compat.so
install: File mod_access_compat.so was not found.
rm -f /usr/local/apache2/modules/mod_auth_basic.so
/home/guest/httpd-2.4.2/srclib/apr/libtool --silent --mode=install install
mod_auth_basic.la /usr/local/apache2/modules/
find: bad status-- /usr/local/apache2/modules/mod_auth_basic.so
install: File mod_auth_basic.so was not found.
rm -f /usr/local/apache2/modules/mod_auth_form.so
/home/guest/httpd-2.4.2/srclib/apr/libtool --silent --mode=install install
mod_auth_form.la /usr/local/apache2/modules/
find: bad status-- /usr/local/apache2/modules/mod_auth_form.so
install: File mod_auth_form.so was not found.
rm -f /usr/local/apache2/modules/mod_auth_digest.so
/home/guest/httpd-2.4.2/srclib/apr/libtool --silent --mode=install install
mod_auth_digest.la /usr/local/apache2/modules/
find: bad status-- /usr/local/apache2/modules/mod_auth_digest.so
install: File mod_auth_digest.so was not found.
rm -f /usr/local/apache2/modules/mod_allowmethods.so
/home/guest/httpd-2.4.2/srclib/apr/libtool --silent --mode=install install
mod_allowmethods.la /usr/local/apache2/modules/
find: bad status-- /usr/local/apache2/modules/mod_allowmethods.so
install: File mod_allowmethods.so was not found.
make[3]: *** [install-modules-yes] Error 2
make[3]: Leaving directory `/home/guest/httpd-2.4.2/modules/aaa'
make[2]: *** [install-recursive] Error 1
make[2]: Leaving directory `/home/guest/httpd-2.4.2/modules/aaa'
make[1]: *** [install-recursive] Error 1
make[1]: Leaving directory `/home/guest/httpd-2.4.2/modules'
make: *** [install-recursive] Error 1

I ran ./configure with these flags : 
--with-pcre=/home/guest/pcre-8.31/pcre-config 
--enable-module=so
--with-mpm=worker 
--enable-so 
--enable-layout=Apache               
--enable-mods-shared=most

The 'make' also successfully completed. 

Any help would be great

Thanks!

-- 
You are receiving this mail because:
You are the assignee for the bug.

---------------------------------------------------------------------
To unsubscribe, e-mail: bugs-unsubscribe@httpd.apache.org
For additional commands, e-mail: bugs-help@httpd.apache.org


Mime
View raw message