httpd-bugs mailing list archives

Site index · List index
Message view « Date » · « Thread »
Top « Date » · « Thread »
From bugzi...@apache.org
Subject DO NOT REPLY [Bug 27535] New: - Apache 2 compile error on Solaris 9 12/03 Sparc
Date Tue, 09 Mar 2004 11:14:57 GMT
DO NOT REPLY TO THIS EMAIL, BUT PLEASE POST YOUR BUG 
RELATED COMMENTS THROUGH THE WEB INTERFACE AVAILABLE AT
<http://issues.apache.org/bugzilla/show_bug.cgi?id=27535>.
ANY REPLY MADE TO THIS MESSAGE WILL NOT BE COLLECTED AND 
INSERTED IN THE BUG DATABASE.

http://issues.apache.org/bugzilla/show_bug.cgi?id=27535

Apache 2 compile error on Solaris 9 12/03 Sparc

           Summary: Apache 2 compile error on Solaris 9 12/03 Sparc
           Product: Apache httpd-2.0
           Version: 2.0.48
          Platform: Sun
        OS/Version: Solaris
            Status: NEW
          Severity: Normal
          Priority: Other
         Component: Build
        AssignedTo: bugs@httpd.apache.org
        ReportedBy: rasche@xcommunycationz.com


I can't compile any branch of Apache 2 on Solaris 9 12/03 machine. It always
hangs there:

make[1]: Leaving directory `/usr/local/httpd-2.0-APACHE_2_0_BRANCH/modules'
Making all in support
make[1]: Entering directory `/usr/local/httpd-2.0-APACHE_2_0_BRANCH/support'
make[2]: Entering directory `/usr/local/httpd-2.0-APACHE_2_0_BRANCH/support'
/usr/local/httpd-2.0-APACHE_2_0_BRANCH/srclib/apr/libtool --silent
--mode=compile gcc  -g -O2 -pthreads    -DSOLARIS2=9 -D_POSIX_PTHREAD_SEMANTICS
-D_REENTRANT -DAP_HAVE_DESIGNATED_INITIALIZER  
-I/usr/local/httpd-2.0-APACHE_2_0_BRANCH/srclib/apr/include
-I/usr/local/httpd-2.0-APACHE_2_0_BRANCH/srclib/apr-util/include
-I/usr/local/include -I. -I/usr/local/httpd-2.0-APACHE_2_0_BRANCH/os/unix
-I/usr/local/httpd-2.0-APACHE_2_0_BRANCH/server/mpm/experimental/leader
-I/usr/local/httpd-2.0-APACHE_2_0_BRANCH/modules/http
-I/usr/local/httpd-2.0-APACHE_2_0_BRANCH/modules/filters
-I/usr/local/httpd-2.0-APACHE_2_0_BRANCH/modules/proxy
-I/usr/local/httpd-2.0-APACHE_2_0_BRANCH/include
-I/usr/local/httpd-2.0-APACHE_2_0_BRANCH/modules/generators
-I/usr/local/httpd-2.0-APACHE_2_0_BRANCH/modules/dav/main -prefer-non-pic
-static -c htpasswd.c && touch htpasswd.lo
/usr/local/httpd-2.0-APACHE_2_0_BRANCH/srclib/apr/libtool --silent --mode=link
gcc  -g -O2 -pthreads    -DSOLARIS2=9 -D_POSIX_PTHREAD_SEMANTICS -D_REENTRANT
-DAP_HAVE_DESIGNATED_INITIALIZER  
-I/usr/local/httpd-2.0-APACHE_2_0_BRANCH/srclib/apr/include
-I/usr/local/httpd-2.0-APACHE_2_0_BRANCH/srclib/apr-util/include
-I/usr/local/include -I. -I/usr/local/httpd-2.0-APACHE_2_0_BRANCH/os/unix
-I/usr/local/httpd-2.0-APACHE_2_0_BRANCH/server/mpm/experimental/leader
-I/usr/local/httpd-2.0-APACHE_2_0_BRANCH/modules/http
-I/usr/local/httpd-2.0-APACHE_2_0_BRANCH/modules/filters
-I/usr/local/httpd-2.0-APACHE_2_0_BRANCH/modules/proxy
-I/usr/local/httpd-2.0-APACHE_2_0_BRANCH/include
-I/usr/local/httpd-2.0-APACHE_2_0_BRANCH/modules/generators
-I/usr/local/httpd-2.0-APACHE_2_0_BRANCH/modules/dav/main -export-dynamic
-L/usr/local/lib   -o htpasswd  htpasswd.lo   
/usr/local/httpd-2.0-APACHE_2_0_BRANCH/srclib/pcre/libpcre.la
/usr/local/httpd-2.0-APACHE_2_0_BRANCH/srclib/apr-util/libaprutil-0.la -lexpat
/usr/local/httpd-2.0-APACHE_2_0_BRANCH/srclib/apr/libapr-0.la -lsendfile -lrt
-lm -lsocket -lnsl -lresolv -lpthread -ldl
Undefined                       first referenced
 symbol                             in file
libiconv_close                     
/usr/local/httpd-2.0-APACHE_2_0_BRANCH/srclib/apr-util/.libs/libaprutil-0.so
libiconv                           
/usr/local/httpd-2.0-APACHE_2_0_BRANCH/srclib/apr-util/.libs/libaprutil-0.so
libiconv_open                      
/usr/local/httpd-2.0-APACHE_2_0_BRANCH/srclib/apr-util/.libs/libaprutil-0.so
ld: fatal: Symbol referencing errors. No output written to .libs/htpasswd
collect2: ld returned 1 exit status
make[2]: *** [htpasswd] Error 1
make[2]: Leaving directory `/usr/local/httpd-2.0-APACHE_2_0_BRANCH/support'
make[1]: *** [all-recursive] Error 1
make[1]: Leaving directory `/usr/local/httpd-2.0-APACHE_2_0_BRANCH/support'
make: *** [all-recursive] Error 1

This machine has a freas installed Solaris 9 12/03 Sparc and patched mostly.
My GNU packages like autoconf, gcc and libtool coming from
http://www.blastwave.org/packages.php.

Thank you in advance!

Regards, Jan

---------------------------------------------------------------------
To unsubscribe, e-mail: bugs-unsubscribe@httpd.apache.org
For additional commands, e-mail: bugs-help@httpd.apache.org


Mime
View raw message