httpd-bugs mailing list archives

Site index · List index
Message view « Date » · « Thread »
Top « Date » · « Thread »
From bugzi...@apache.org
Subject DO NOT REPLY [Bug 10991] New: - 2.0 CVS - Win32/Cygwin compile failure
Date Fri, 19 Jul 2002 17:52:29 GMT
DO NOT REPLY TO THIS EMAIL, BUT PLEASE POST YOUR BUG 
RELATED COMMENTS THROUGH THE WEB INTERFACE AVAILABLE AT
<http://nagoya.apache.org/bugzilla/show_bug.cgi?id=10991>.
ANY REPLY MADE TO THIS MESSAGE WILL NOT BE COLLECTED AND 
INSERTED IN THE BUG DATABASE.

http://nagoya.apache.org/bugzilla/show_bug.cgi?id=10991

2.0 CVS - Win32/Cygwin compile failure

           Summary: 2.0 CVS - Win32/Cygwin compile failure
           Product: Apache httpd-2.0
           Version: HEAD
          Platform: PC
        OS/Version: Windows NT/2K
            Status: NEW
          Severity: Blocker
          Priority: Other
         Component: Build
        AssignedTo: bugs@httpd.apache.org
        ReportedBy: jari.aalto@poboxes.com


Here is compile report under latest cygwin - latest httpd CVS 2.0.
config.log at the end.

-- jari.aalto@poboxes.com


gcc (GCC) 3.1.1 20020714 (prerelease)
GNU Make version 3.79.1
hostname = W2KPICASSO
uname -m = i686
uname -r = 1.3.11(0.53/3/2)
uname -s = CYGWIN_NT-5.0
uname -v = 2002-06-21 22:04


Found newer headers. Will rebuild aprutil.exp.
rm -f aprutil.exp
gcc -E -DHAVE_CONFIG_H -DCYGWIN   -I/usr/src/cvs-source/httpd-2.0/srclib/apr-
util/include -I/usr/src/cvs-source/httpd-2.0/srclib/apr-util/include/private  -
I/usr/src/cvs-source/httpd-2.0/srclib/apr/include    exports.c | 
grep "ap_hack_" | sed -e 's/^.*[)]\(.*\);$/\1/' >> aprutil.exp
gcc -E -DHAVE_CONFIG_H -DCYGWIN   -I/usr/src/cvs-source/httpd-2.0/srclib/apr-
util/include -I/usr/src/cvs-source/httpd-2.0/srclib/apr-util/include/private  -
I/usr/src/cvs-source/httpd-2.0/srclib/apr/include    export_vars.h | sed -
e 's/^\#[^!]*//' | sed -e '/^$/d' >> aprutil.exp
make[3]: Leaving directory `/usr/src/cvs-source/httpd-2.0/srclib/apr-util'
make[2]: Leaving directory `/usr/src/cvs-source/httpd-2.0/srclib/apr-util'
Making all in pcre
make[2]: Entering directory `/usr/src/cvs-source/httpd-2.0/srclib/pcre'
make[3]: Entering directory `/usr/src/cvs-source/httpd-2.0/srclib/pcre'
make[3]: Nothing to be done for `local-all'.
make[3]: Leaving directory `/usr/src/cvs-source/httpd-2.0/srclib/pcre'
make[2]: Leaving directory `/usr/src/cvs-source/httpd-2.0/srclib/pcre'
make[1]: Leaving directory `/usr/src/cvs-source/httpd-2.0/srclib'
Making all in os
make[1]: Entering directory `/usr/src/cvs-source/httpd-2.0/os'
Making all in unix
make[2]: Entering directory `/usr/src/cvs-source/httpd-2.0/os/unix'
make[3]: Entering directory `/usr/src/cvs-source/httpd-2.0/os/unix'
/bin/sh /usr/src/cvs-source/httpd-2.0/srclib/apr/libtool --silent --
mode=compile gcc    -static -Wall -Wno-format -Wstrict-prototypes -Wmissing-
prototypes -mwindows -DGETTEXT_STATIC  -DCYGWIN -
DAP_HAVE_DESIGNATED_INITIALIZER   -I/usr/src/cvs-source/httpd-
2.0/srclib/apr/include -I/usr/src/cvs-source/httpd-2.0/srclib/apr-util/include -
I. -I/usr/src/cvs-source/httpd-2.0/os/unix -I/usr/src/cvs-source/httpd-
2.0/server/mpm/prefork -I/usr/src/cvs-source/httpd-2.0/modules/http -
I/usr/src/cvs-source/httpd-2.0/modules/filters -I/usr/src/cvs-source/httpd-
2.0/modules/proxy -I/usr/src/cvs-source/httpd-2.0/include -I/usr/src/cvs-
source/httpd-2.0/modules/dav/main -prefer-non-pic -static -c unixd.c && touch 
unixd.lo
In file included from unixd.c:90:
/usr/local/include/sys/sem.h:52: field `sem_perm' has incomplete type
unixd.c: In function `unixd_set_user':
unixd.c:198: warning: implicit declaration of function `ap_uname2id'
unixd.c: In function `unixd_set_group':
unixd.c:224: warning: implicit declaration of function `ap_gname2id'
make[3]: *** [unixd.lo] Error 1
make[3]: Leaving directory `/usr/src/cvs-source/httpd-2.0/os/unix'
make[2]: *** [all-recursive] Error 1
make[2]: Leaving directory `/usr/src/cvs-source/httpd-2.0/os/unix'
make[1]: *** [all-recursive] Error 1
make[1]: Leaving directory `/usr/src/cvs-source/httpd-2.0/os'
make: *** [all-recursive] Error 1


==========================================================================

root@W2KPICASSO:/usr/src/cvs-source/httpd-2.0$ cat config.log 
This file contains any messages produced by compilers while
running configure, to aid debugging if configure makes a mistake.

It was created by configure, which was
generated by GNU Autoconf 2.52.  Invocation command line was

  $ ./configure 

## ---------- ##
## Platform.  ##
## ---------- ##

hostname = W2KPICASSO
uname -m = i686
uname -r = 1.3.11(0.53/3/2)
uname -s = CYGWIN_NT-5.0
uname -v = 2002-06-21 22:04

/usr/bin/uname -p = unknown
/bin/uname -X     = unknown

/bin/arch              = unknown
/usr/bin/arch -k       = unknown
/usr/convex/getsysinfo = unknown
hostinfo               = unknown
/bin/machine           = unknown
/usr/bin/oslevel       = unknown
/bin/universe          = unknown

PATH = /usr/local/bin:/usr/bin:/cygdrive/h/bin/emacs/XEmacs/bin/i686-pc-
cygwin:/usr/local/bin:/usr/bin:/usr/bin:/usr/sbin:/sbin:/usr/X11R6/bin:/cygdrive
/e/home/jaalto/bin/bat/picasso/bin:/cygdrive/e/home/jaalto/tmp/sforge/perl-
text2html/bin:/cygdrive/e/home/jaalto/tmp/sforge/perl-
webget/bin:/cygdrive/e/home/jaalto/bin/perl/my:/cygdrive/h/bin/dos:/cygdrive/h/b
in/dos/misc:/cygdrive/h/bin/dos/other:/cygdrive/h/bin/dos/zip:/cygdrive/h/bin/do
s/vc/rcs/gnu-
5.7/bin:/cygdrive/e/home/jaalto/bin/shell:/cygdrive/e/home/jaalto/elisp/tiny/bin
:/cygdrive/h/bin/dos:/cygdrive/h/bin/dos:/cygdrive/h/bin/dos/expat:/cygdrive/h/b
in/dos/expat/Libs:/cygdrive/g/Program 
Files/commercial/Perforce:/cygdrive/h/bin/sql/mysql-
w2k/bin:/cygdrive/d/wbin/server/apache:/cygdrive/h/bin/lang/php/php4:/cygdrive/h
/bin/lang/php/php4/dlls:/cygdrive/h/bin/apache/jakarta-
tomcat/bin:/cygdrive/h/bin/lang/perl/bin:/cygdrive/i/java/sun/jdk1.3_02/bin:/cyg
drive/h/bin/oracle/ora81/bin:/cygdrive/g/Program 
Files/Oracle/jre/1.1.7/bin:/cygdrive/g/WINNT/system32:/cygdrive/g/WINNT:/cygdriv
e/g/WINNT/System32/Wbem:/cygdrive/g/Program Files/Resource Pro 
Kit/:/usr/share/site-
perl/script/misc:/cygdrive/h/bin/dos/crypto/gpg:/cygdrive/h/bin/dos/crypto/pgp:/
cygdrive/h/bin/emacs/XEmacs/XEmacs-21.4.6/i586-pc-
win32:/cygdrive/h/bin/emacs/gnu-emacs/emacs-
21.1/bin:/usr/local/pgsql/bin:/usr/local/pgsql/lib:/usr/X11R6/bin:/usr/local/Ber
keleyDB.3.3/bin:/usr/share/site-perl/script:/usr/share/site-
perl/script/misc:/cygdrive/e/home/jaalto/tmp/sforge/perl-
dyndns/bin:/cygdrive/e/home/jaalto/tmp/sforge/perl-
webget/bin:/cygdrive/e/home/jaalto/elisp/tiny/bin:.:/lib/gcc-lib/i686-pc-
cygwin/2.95.3-5

## ------------ ##
## Core tests.  ##
## ------------ ##

configure:1035: PATH=".;."; conftest.sh
conftest.sh: not found
configure:1038: $? = 127
configure:1150: checking for chosen layout
configure:1152: result: Apache
configure:1767: checking for working mkdir -p
configure:1783: result: yes
configure:1797: checking build system type
configure:1815: result: i686-pc-cygwin
configure:1823: checking host system type
configure:1837: result: i686-pc-cygwin
configure:1845: checking target system type
configure:1859: result: i686-pc-cygwin
configure:1887: checking for APR
configure:1953: result: reconfig
configure:2159: checking for APR-util
configure:2227: result: reconfig
configure:2675: checking for rm
configure:2692: found /usr/bin/rm
configure:2703: result: /usr/bin/rm
configure:2714: checking for mawk
configure:2740: result: no
configure:2714: checking for gawk
configure:2729: found /usr/bin/gawk
configure:2737: result: gawk
configure:2790: checking for gcc
configure:2813: result: gcc
configure:3042: checking for C compiler version
configure:3045: gcc --version </dev/null >&5
gcc (GCC) 3.1.1 20020714 (prerelease)
Copyright (C) 2002 Free Software Foundation, Inc.
This is free software; see the source for copying conditions.  There is NO
warranty; not even for MERCHANTABILITY or FITNESS FOR A PARTICULAR PURPOSE.

configure:3048: $? = 0
configure:3050: gcc -v </dev/null >&5
Reading specs from /usr/lib/gcc-lib/i686-pc-cygwin/3.1.1/specs
Configured with: /netrel/src/gcc-3.1.1-3/configure --enable-
languages=c,c++,f77,java --enable-libgcj --enable-threads=posix --with-system-
zlib --enable-nls --without-included-gettext --disable-shared --enable-
interpreter --disable-sjlj-exceptions --disable-version-specific-runtime-libs --
build=i686-pc-linux --host=i686-pc-cygwin --target=i686-pc-cygwin --enable-
haifa --prefix=/usr --exec-prefix=/usr --sysconfdir=/etc --libdir=/usr/lib --
includedir=/nonexistent/include --libexecdir=/usr/sbin
Thread model: posix
gcc version 3.1.1 20020714 (prerelease)
configure:3053: $? = 0
configure:3055: gcc -V </dev/null >&5
gcc: argument to `-V' is missing
configure:3058: $? = 1
configure:3078: checking for C compiler default output
configure:3081: gcc -static -Wall -Wno-format -Wstrict-prototypes -Wmissing-
prototypes -mwindows -DGETTEXT_STATIC  -DCYGWIN   conftest.c  >&5
configure:3066: warning: function declaration isn't a prototype
/usr/lib/gcc-lib/i686-pc-cygwin/3.1.1/../../../../i686-pc-cygwin/bin/ld: 
warning: cannot find entry symbol _WinMainCRTStartup; defaulting to 00401000
configure:3084: $? = 0
configure:3113: result: a.exe
configure:3118: checking whether the C compiler works
configure:3124: ./a.exe
configure:3127: $? = 0
configure:3142: result: yes
configure:3149: checking whether we are cross compiling
configure:3151: result: no
configure:3154: checking for executable suffix
configure:3156: gcc -o conftest.exe -static -Wall -Wno-format -Wstrict-
prototypes -Wmissing-prototypes -mwindows -DGETTEXT_STATIC  -DCYGWIN   
conftest.c  >&5
configure:3066: warning: function declaration isn't a prototype
/usr/lib/gcc-lib/i686-pc-cygwin/3.1.1/../../../../i686-pc-cygwin/bin/ld: 
warning: cannot find entry symbol _WinMainCRTStartup; defaulting to 00401000
configure:3159: $? = 0
configure:3181: result: .exe
configure:3187: checking for object suffix
configure:3205: gcc -c -static -Wall -Wno-format -Wstrict-prototypes -Wmissing-
prototypes -mwindows -DGETTEXT_STATIC  -DCYGWIN conftest.c >&5
configure:3197: warning: function declaration isn't a prototype
configure:3208: $? = 0
configure:3227: result: o
configure:3231: checking whether we are using the GNU C compiler
configure:3252: gcc -c -static -Wall -Wno-format -Wstrict-prototypes -Wmissing-
prototypes -mwindows -DGETTEXT_STATIC  -DCYGWIN conftest.c >&5
configure:3241: warning: function declaration isn't a prototype
configure:3255: $? = 0
configure:3258: test -s conftest.o
configure:3261: $? = 0
configure:3273: result: yes
configure:3279: checking whether gcc accepts -g
configure:3297: gcc -c -g  -DCYGWIN conftest.c >&5
configure:3300: $? = 0
configure:3303: test -s conftest.o
configure:3306: $? = 0
configure:3316: result: yes
configure:3343: gcc -c -static -Wall -Wno-format -Wstrict-prototypes -Wmissing-
prototypes -mwindows -DGETTEXT_STATIC  -DCYGWIN conftest.c >&5
conftest.c:2: parse error before "me"
configure:3346: $? = 1
configure: failed program was:
#ifndef __cplusplus
  choke me
#endif
configure:3449: checking how to run the C preprocessor
configure:3475: gcc -E  -DCYGWIN conftest.c
configure:3481: $? = 0
configure:3508: gcc -E  -DCYGWIN conftest.c
configure:3505:28: ac_nonexistent.h: No such file or directory
configure:3514: $? = 1
configure: failed program was:
#line 3504 "configure"
#include "confdefs.h"
#include <ac_nonexistent.h>
configure:3551: result: gcc -E
configure:3566: gcc -E  -DCYGWIN conftest.c
configure:3572: $? = 0
configure:3599: gcc -E  -DCYGWIN conftest.c
configure:3596:28: ac_nonexistent.h: No such file or directory
configure:3605: $? = 1
configure: failed program was:
#line 3595 "configure"
#include "confdefs.h"
#include <ac_nonexistent.h>
configure:3656: checking for a BSD compatible install
configure:3705: result: /usr/bin/install -c
configure:3716: checking whether ln -s works
configure:3720: result: yes
configure:3765: checking for ranlib
configure:3780: found /usr/bin/ranlib
configure:3789: result: ranlib
configure:3804: checking for AIX
configure:3823: result: no
configure:3829: checking for POSIXized ISC
configure:3848: result: no
configure:3853: checking for minix/config.h
configure:3863: gcc -E  -DCYGWIN conftest.c
configure:3860:26: minix/config.h: No such file or directory
configure:3869: $? = 1
configure: failed program was:
#line 3859 "configure"
#include "confdefs.h"
#include <minix/config.h>
configure:3888: result: no
configure:3914: checking for ANSI C header files
configure:3928: gcc -E  -DCYGWIN conftest.c
configure:3934: $? = 0
configure:4021: gcc -o conftest.exe -static -Wall -Wno-format -Wstrict-
prototypes -Wmissing-prototypes -mwindows -DGETTEXT_STATIC  -DCYGWIN   
conftest.c  >&5
configure:4008: warning: function declaration isn't a prototype
configure: In function `main':
configure:4013: warning: implicit declaration of function `exit'
/usr/lib/gcc-lib/i686-pc-cygwin/3.1.1/../../../../i686-pc-cygwin/bin/ld: 
warning: cannot find entry symbol _WinMainCRTStartup; defaulting to 00401000
configure:4024: $? = 0
configure:4026: ./conftest.exe
configure:4029: $? = 0
configure:4042: result: yes
configure:4074: checking for string.h
configure:4084: gcc -E  -DCYGWIN conftest.c
configure:4090: $? = 0
configure:4109: result: yes
configure:4074: checking for limits.h
configure:4084: gcc -E  -DCYGWIN conftest.c
configure:4090: $? = 0
configure:4109: result: yes
configure:4074: checking for unistd.h
configure:4084: gcc -E  -DCYGWIN conftest.c
configure:4090: $? = 0
configure:4109: result: yes
configure:4074: checking for sys/socket.h
configure:4084: gcc -E  -DCYGWIN conftest.c
configure:4090: $? = 0
configure:4109: result: yes
configure:4074: checking for pwd.h
configure:4084: gcc -E  -DCYGWIN conftest.c
configure:4090: $? = 0
configure:4109: result: yes
configure:4074: checking for grp.h
configure:4084: gcc -E  -DCYGWIN conftest.c
configure:4090: $? = 0
configure:4109: result: yes
configure:4074: checking for strings.h
configure:4084: gcc -E  -DCYGWIN conftest.c
configure:4090: $? = 0
configure:4109: result: yes
configure:4074: checking for sys/processor.h
configure:4084: gcc -E  -DCYGWIN conftest.c
configure:4081:27: sys/processor.h: No such file or directory
configure:4090: $? = 1
configure: failed program was:
#line 4080 "configure"
#include "confdefs.h"
#include <sys/processor.h>
configure:4109: result: no
configure:4074: checking for sys/sem.h
configure:4084: gcc -E  -DCYGWIN conftest.c
configure:4090: $? = 0
configure:4109: result: yes
configure:4119: checking for sys/wait.h that is POSIX.1 compatible
configure:4147: gcc -c -static -Wall -Wno-format -Wstrict-prototypes -Wmissing-
prototypes -mwindows -DGETTEXT_STATIC  -DCYGWIN conftest.c >&5
configure:4137: warning: function declaration isn't a prototype
configure:4150: $? = 0
configure:4153: test -s conftest.o
configure:4156: $? = 0
configure:4166: result: yes
configure:4176: checking for gcc option to accept ANSI C
configure:4233: gcc  -c -static -Wall -Wno-format -Wstrict-prototypes -Wmissing-
prototypes -mwindows -DGETTEXT_STATIC  -DCYGWIN conftest.c >&5
configure:4193: warning: function declaration isn't a prototype
configure:4215: warning: function declaration isn't a prototype
configure:4236: $? = 0
configure:4239: test -s conftest.o
configure:4242: $? = 0
configure:4259: result: none needed
configure:4267: checking for an ANSI C-conforming const
configure:4331: gcc -c -static -Wall -Wno-format -Wstrict-prototypes -Wmissing-
prototypes -mwindows -DGETTEXT_STATIC  -DCYGWIN conftest.c >&5
configure:4277: warning: function declaration isn't a prototype
configure: In function `main':
configure:4301: warning: unused variable `s'
configure:4321: warning: unused variable `foo'
configure:4282: warning: unused variable `x'
configure:4288: warning: unused variable `zero'
configure:4334: $? = 0
configure:4337: test -s conftest.o
configure:4340: $? = 0
configure:4350: result: yes
configure:4399: checking for getpwnam
configure:4436: gcc -o conftest.exe -static -Wall -Wno-format -Wstrict-
prototypes -Wmissing-prototypes -mwindows -DGETTEXT_STATIC  -DCYGWIN   
conftest.c  >&5
configure:4415: warning: function declaration isn't a prototype
configure:4416: warning: function declaration isn't a prototype
configure:4420: warning: function declaration isn't a prototype
/usr/lib/gcc-lib/i686-pc-cygwin/3.1.1/../../../../i686-pc-cygwin/bin/ld: 
warning: cannot find entry symbol _WinMainCRTStartup; defaulting to 00401000
configure:4439: $? = 0
configure:4442: test -s conftest.exe
configure:4445: $? = 0
configure:4455: result: yes
configure:4399: checking for getgrnam
configure:4436: gcc -o conftest.exe -static -Wall -Wno-format -Wstrict-
prototypes -Wmissing-prototypes -mwindows -DGETTEXT_STATIC  -DCYGWIN   
conftest.c  >&5
configure:4415: warning: function declaration isn't a prototype
configure:4416: warning: function declaration isn't a prototype
configure:4420: warning: function declaration isn't a prototype
/usr/lib/gcc-lib/i686-pc-cygwin/3.1.1/../../../../i686-pc-cygwin/bin/ld: 
warning: cannot find entry symbol _WinMainCRTStartup; defaulting to 00401000
configure:4439: $? = 0
configure:4442: test -s conftest.exe
configure:4445: $? = 0
configure:4455: result: yes
configure:4399: checking for initgroups
configure:4436: gcc -o conftest.exe -static -Wall -Wno-format -Wstrict-
prototypes -Wmissing-prototypes -mwindows -DGETTEXT_STATIC  -DCYGWIN   
conftest.c  >&5
configure:4415: warning: function declaration isn't a prototype
configure:4416: warning: function declaration isn't a prototype
configure:4420: warning: function declaration isn't a prototype
/usr/lib/gcc-lib/i686-pc-cygwin/3.1.1/../../../../i686-pc-cygwin/bin/ld: 
warning: cannot find entry symbol _WinMainCRTStartup; defaulting to 00401000
configure:4439: $? = 0
configure:4442: test -s conftest.exe
configure:4445: $? = 0
configure:4455: result: yes
configure:4399: checking for bindprocessor
configure:4436: gcc -o conftest.exe -static -Wall -Wno-format -Wstrict-
prototypes -Wmissing-prototypes -mwindows -DGETTEXT_STATIC  -DCYGWIN   
conftest.c  >&5
configure:4415: warning: function declaration isn't a prototype
configure:4416: warning: function declaration isn't a prototype
configure:4420: warning: function declaration isn't a prototype
/usr/lib/gcc-lib/i686-pc-cygwin/3.1.1/../../../../i686-pc-cygwin/bin/ld: 
warning: cannot find entry symbol _WinMainCRTStartup; defaulting to 00401000
/tmp/cc0kVLl7.o(.text+0x24):conftest.c: undefined reference to `_bindprocessor'
collect2: ld returned 1 exit status
configure:4439: $? = 1
configure: failed program was:
#line 4405 "configure"
#include "confdefs.h"
/* System header to define __stub macros and hopefully few prototypes,
    which can conflict with char bindprocessor (); below.  */
#include <assert.h>
/* Override any gcc2 internal prototype to avoid an error.  */
#ifdef __cplusplus
extern "C"
#endif
/* We use char because int might match the return type of a gcc2
   builtin and then its argument prototype would still apply.  */
char bindprocessor ();
char (*f) ();

int
main ()
{
/* The GNU C library defines this for functions which it implements
    to always fail with ENOSYS.  Some functions are actually named
    something starting with __ and the normal name is an alias.  */
#if defined (__stub_bindprocessor) || defined (__stub___bindprocessor)
choke me
#else
f = bindprocessor;
#endif

  ;
  return 0;
}
configure:4455: result: no
configure:4399: checking for timegm
configure:4436: gcc -o conftest.exe -static -Wall -Wno-format -Wstrict-
prototypes -Wmissing-prototypes -mwindows -DGETTEXT_STATIC  -DCYGWIN   
conftest.c  >&5
configure:4415: warning: function declaration isn't a prototype
configure:4416: warning: function declaration isn't a prototype
configure:4420: warning: function declaration isn't a prototype
/usr/lib/gcc-lib/i686-pc-cygwin/3.1.1/../../../../i686-pc-cygwin/bin/ld: 
warning: cannot find entry symbol _WinMainCRTStartup; defaulting to 00401000
/tmp/ccrl2NW4.o(.text+0x24):conftest.c: undefined reference to `_timegm'
collect2: ld returned 1 exit status
configure:4439: $? = 1
configure: failed program was:
#line 4405 "configure"
#include "confdefs.h"
/* System header to define __stub macros and hopefully few prototypes,
    which can conflict with char timegm (); below.  */
#include <assert.h>
/* Override any gcc2 internal prototype to avoid an error.  */
#ifdef __cplusplus
extern "C"
#endif
/* We use char because int might match the return type of a gcc2
   builtin and then its argument prototype would still apply.  */
char timegm ();
char (*f) ();

int
main ()
{
/* The GNU C library defines this for functions which it implements
    to always fail with ENOSYS.  Some functions are actually named
    something starting with __ and the normal name is an alias.  */
#if defined (__stub_timegm) || defined (__stub___timegm)
choke me
#else
f = timegm;
#endif

  ;
  return 0;
}
configure:4455: result: no
configure:4465: checking for tm_gmtoff in struct tm
configure:4484: gcc -c -static -Wall -Wno-format -Wstrict-prototypes -Wmissing-
prototypes -mwindows -DGETTEXT_STATIC  -DCYGWIN conftest.c >&5
configure:4476: warning: function declaration isn't a prototype
configure: In function `main':
configure:4477: structure has no member named `tm_gmtoff'
configure:4487: $? = 1
configure: failed program was:
#line 4471 "configure"
#include "confdefs.h"
#include <sys/types.h>
#include <time.h>
int
main ()
{
struct tm tm; tm.tm_gmtoff;
  ;
  return 0;
}
configure:4503: result: no
configure:4612: checking whether to enable mod_access
configure:4650: result: yes (default)
configure:4697: checking whether to enable mod_auth
configure:4735: result: yes (default)
configure:4782: checking whether to enable mod_auth_anon
configure:4820: result: no
configure:4867: checking whether to enable mod_auth_dbm
configure:4905: result: no
configure:4952: checking whether to enable mod_auth_digest
configure:5040: result: no
configure:5125: checking whether to enable mod_file_cache
configure:5163: result: no
configure:5248: checking whether to enable mod_echo
configure:5286: result: no
configure:5462: checking whether to enable mod_charset_lite
configure:5500: result: no
configure:5552: checking whether to enable mod_cache
configure:5590: result: no
configure:5637: checking whether to enable mod_disk_cache
configure:5675: result: no
configure:5722: checking whether to enable mod_mem_cache
configure:5760: result: no
configure:5807: checking whether to enable mod_example
configure:5845: result: no
configure:5892: checking whether to enable mod_ext_filter
configure:5930: result: no
configure:5977: checking whether to enable mod_case_filter
configure:6015: result: no
configure:6062: checking whether to enable mod_case_filter_in
configure:6100: result: no
configure:6165: checking whether to enable mod_include
configure:6203: result: yes (default)
configure:6270: checking whether to enable mod_deflate
configure:6542: result: no
configure:6607: checking whether to enable mod_log_config
configure:6645: result: yes (default)
configure:6710: checking whether to enable mod_env
configure:6748: result: yes (default)
configure:6795: checking whether to enable mod_mime_magic
configure:6833: result: no
configure:6880: checking whether to enable mod_cern_meta
configure:6918: result: no
configure:6965: checking whether to enable mod_expires
configure:7003: result: no
configure:7050: checking whether to enable mod_headers
configure:7088: result: no
configure:7135: checking whether to enable mod_usertrack
configure:7305: result: no
configure:7352: checking whether to enable mod_unique_id
configure:7390: result: no
configure:7437: checking whether to enable mod_setenvif
configure:7475: result: yes (default)
configure:7570: checking whether to enable mod_proxy
configure:7608: result: no
configure:7669: checking whether to enable mod_proxy_connect
configure:7707: result: no
configure:7754: checking whether to enable mod_proxy_ftp
configure:7792: result: no
configure:7839: checking whether to enable mod_proxy_http
configure:7877: result: no
configure:7944: checking whether to enable mod_ssl
configure:8358: result: no
configure:8423: checking whether to enable mod_optional_hook_export
configure:8461: result: no
configure:8508: checking whether to enable mod_optional_hook_import
configure:8546: result: no
configure:8593: checking whether to enable mod_optional_fn_import
configure:8631: result: no
configure:8678: checking whether to enable mod_optional_fn_export
configure:8716: result: no
configure:8763: checking whether to enable mod_bucketeer
configure:8801: result: no
configure:8883: checking for target platform
configure:8908: result: cygwin
configure:9125: checking for bstring.h
configure:9135: gcc -E  -DCYGWIN conftest.c
configure:9132:21: bstring.h: No such file or directory
configure:9141: $? = 1
configure: failed program was:
#line 9131 "configure"
#include "confdefs.h"
#include <bstring.h>
configure:9160: result: no
configure:9125: checking for unistd.h
configure:9160: result: yes
configure:9174: checking for syslog
configure:9211: gcc -o conftest.exe -static -Wall -Wno-format -Wstrict-
prototypes -Wmissing-prototypes -mwindows -DGETTEXT_STATIC  -DCYGWIN   
conftest.c  >&5
configure:9190: warning: function declaration isn't a prototype
configure:9191: warning: function declaration isn't a prototype
configure:9195: warning: function declaration isn't a prototype
/usr/lib/gcc-lib/i686-pc-cygwin/3.1.1/../../../../i686-pc-cygwin/bin/ld: 
warning: cannot find entry symbol _WinMainCRTStartup; defaulting to 00401000
configure:9214: $? = 0
configure:9217: test -s conftest.exe
configure:9220: $? = 0
configure:9230: result: yes
configure:9244: checking for sys/times.h
configure:9254: gcc -E  -DCYGWIN conftest.c
configure:9260: $? = 0
configure:9279: result: yes
configure:9293: checking for times
configure:9330: gcc -o conftest.exe -static -Wall -Wno-format -Wstrict-
prototypes -Wmissing-prototypes -mwindows -DGETTEXT_STATIC  -DCYGWIN   
conftest.c  >&5
configure:9309: warning: function declaration isn't a prototype
configure:9310: warning: function declaration isn't a prototype
configure:9314: warning: function declaration isn't a prototype
/usr/lib/gcc-lib/i686-pc-cygwin/3.1.1/../../../../i686-pc-cygwin/bin/ld: 
warning: cannot find entry symbol _WinMainCRTStartup; defaulting to 00401000
configure:9333: $? = 0
configure:9336: test -s conftest.exe
configure:9339: $? = 0
configure:9349: result: yes
configure:9359: checking which MPM to use
configure:9375: result: prefork
configure:9996: checking whether to enable mod_http
configure:10034: result: yes
configure:10081: checking whether to enable mod_mime
configure:10119: result: yes (default)
configure:10177: checking for extra modules
configure:10222: result: no extra modules
configure:10242: checking whether to enable mod_dav
configure:10280: result: no
configure:10370: checking whether to enable mod_status
configure:10408: result: yes (default)
configure:10455: checking whether to enable mod_autoindex
configure:10493: result: yes (default)
configure:10540: checking whether to enable mod_asis
configure:10578: result: yes (default)
configure:10625: checking whether to enable mod_info
configure:10663: result: no
configure:10710: checking whether to enable mod_suexec
configure:10762: result: no
configure:11008: checking whether to enable mod_cgi
configure:11046: result: yes (default)
configure:11093: checking whether to enable mod_cgid
configure:11131: result: no
configure:11532: checking whether to enable mod_dav_fs
configure:11570: result: no
configure:11635: checking whether to enable mod_vhost_alias
configure:11673: result: no
configure:11720: checking whether to enable mod_negotiation
configure:11758: result: yes (default)
configure:11805: checking whether to enable mod_dir
configure:11843: result: yes (default)
configure:11890: checking whether to enable mod_imap
configure:11928: result: yes (default)
configure:11975: checking whether to enable mod_actions
configure:12013: result: yes (default)
configure:12060: checking whether to enable mod_speling
configure:12098: result: no
configure:12145: checking whether to enable mod_userdir
configure:12183: result: yes (default)
configure:12230: checking whether to enable mod_alias
configure:12268: result: yes (default)
configure:12315: checking whether to enable mod_rewrite
configure:12386: result: no
configure:12460: gcc -c -static -Wall -Wno-format -Wstrict-prototypes -Wmissing-
prototypes -mwindows -DGETTEXT_STATIC  -DCYGWIN -I/include -I/usr/src/cvs-
source/httpd-2.0/srclib/apr/include conftest.c >&5
cc1.exe: warning: changing search order for system directory "/include"
cc1.exe: warning:   as it has already been specified as a non-system directory
configure:12448: warning: function declaration isn't a prototype
configure:12463: $? = 0
configure:12466: test -s conftest.o
configure:12469: $? = 0
configure:12493: checking whether to enable mod_so
configure:12531: result: yes
configure:12855: checking whether byte ordering is bigendian
configure:12880: gcc -c -static -Wall -Wno-format -Wstrict-prototypes -Wmissing-
prototypes -mwindows -DGETTEXT_STATIC  -DCYGWIN conftest.c >&5
configure:12869: warning: function declaration isn't a prototype
configure:12883: $? = 0
configure:12886: test -s conftest.o
configure:12889: $? = 0
configure:12910: gcc -c -static -Wall -Wno-format -Wstrict-prototypes -Wmissing-
prototypes -mwindows -DGETTEXT_STATIC  -DCYGWIN conftest.c >&5
configure:12899: warning: function declaration isn't a prototype
configure: In function `main':
configure:12901: `not' undeclared (first use in this function)
configure:12901: (Each undeclared identifier is reported only once
configure:12901: for each function it appears in.)
configure:12901: parse error before "big"
configure:12913: $? = 1
configure: failed program was:
#line 12893 "configure"
#include "confdefs.h"
#include <sys/types.h>
#include <sys/param.h>

int
main ()
{
#if BYTE_ORDER != BIG_ENDIAN
 not big endian
#endif

  ;
  return 0;
}
configure:12977: result: no
configure:13367: creating ./config.status

## ----------------------- ##
## Running config.status.  ##
## ----------------------- ##

This file was extended by config.status 2.52, executed with
  CONFIG_FILES    = 
  CONFIG_HEADERS  = 
  CONFIG_LINKS    = 
  CONFIG_COMMANDS = 
  > ./config.status 
on W2KPICASSO

config.status:13961: creating docs/conf/httpd-std.conf
config.status:13961: creating include/ap_config_layout.h
config.status:13961: creating support/apxs
config.status:13961: creating support/apachectl
config.status:13961: creating support/dbmmanage
config.status:13961: creating support/envvars-std
config.status:13961: creating support/log_server_status
config.status:13961: creating support/logresolve.pl
config.status:13961: creating support/phf_abuse_log.cgi
config.status:13961: creating support/split-logfile
config.status:13961: creating build/rules.mk
config.status:14053: creating include/ap_config_auto.h

## ----------------- ##
## Cache variables.  ##
## ----------------- ##

ac_cv_c_bigendian='no'
ac_cv_header_sys_times_h='yes'
ac_cv_header_grp_h='yes'
ac_cv_func_initgroups='yes'
ac_cv_header_pwd_h='yes'
ac_cv_header_bstring_h='no'
ac_cv_prog_cc_g='yes'
ac_cv_env_LDFLAGS_set=''
ac_cv_func_timegm='no'
ac_cv_path_install='/usr/bin/install -c'
ac_cv_c_compiler_gnu='yes'
ac_cv_exeext='.exe'
ac_cv_env_CFLAGS_set='set'
ac_cv_header_sys_wait_h='yes'
ac_cv_env_CPP_value=''
ac_cv_env_CPPFLAGS_set=''
ac_cv_header_minix_config_h='no'
ac_cv_mkdir_p='yes'
apache_cv_mpm='prefork'
ac_cv_env_host_alias_set=''
ac_cv_c_const='yes'
ac_cv_header_sys_sem_h='yes'
ac_cv_env_build_alias_set=''
ac_cv_header_sys_processor_h='no'
ac_cv_header_limits_h='yes'
ac_cv_env_LDFLAGS_value=''
ac_cv_env_target_alias_set=''
ac_cv_prog_cc_stdc=''
ac_cv_host_alias='i686-pc-cygwin'
ac_cv_env_CFLAGS_value='-static -Wall -Wno-format -Wstrict-prototypes -Wmissing-
prototypes -mwindows -DGETTEXT_STATIC'
ac_cv_env_CC_set='set'
ac_cv_func_getgrnam='yes'
ac_cv_header_stdc='yes'
ac_cv_header_strings_h='yes'
ac_cv_header_unistd_h='yes'
ac_cv_header_string_h='yes'
ac_cv_build_alias='i686-pc-cygwin'
ac_cv_env_CPPFLAGS_value=''
ac_cv_func_times='yes'
ac_cv_prog_ac_ct_RANLIB='ranlib'
ac_cv_target_alias='i686-pc-cygwin'
ac_cv_func_bindprocessor='no'
ac_cv_header_sys_socket_h='yes'
ac_cv_host='i686-pc-cygwin'
ac_cv_env_host_alias_value=''
ac_cv_struct_tm_gmtoff='no'
ac_cv_path_RM='/usr/bin/rm'
ac_cv_prog_CPP='gcc -E'
ac_cv_prog_AWK='gawk'
ac_cv_build='i686-pc-cygwin'
ac_cv_env_build_alias_value=''
ac_cv_prog_ac_ct_CC='gcc'
ac_cv_target='i686-pc-cygwin'
ac_cv_env_target_alias_value=''
ac_cv_env_CC_value='gcc'
ac_cv_func_getpwnam='yes'
ac_cv_env_CPP_set=''
ac_cv_func_syslog='yes'
ac_cv_objext='o'

## ------------ ##
## confdefs.h.  ##
## ------------ ##

#define STDC_HEADERS 1
#define HAVE_STRING_H 1
#define HAVE_LIMITS_H 1
#define HAVE_UNISTD_H 1
#define HAVE_SYS_SOCKET_H 1
#define HAVE_PWD_H 1
#define HAVE_GRP_H 1
#define HAVE_STRINGS_H 1
#define HAVE_SYS_SEM_H 1
#define HAVE_SYS_WAIT_H 1
#define HAVE_GETPWNAM 1
#define HAVE_GETGRNAM 1
#define HAVE_INITGROUPS 1
#define HAVE_UNISTD_H 1
#define HAVE_SYSLOG 1
#define HAVE_SYS_TIMES_H 1
#define HAVE_TIMES 1
#define AP_USING_AUTOCONF 1
#define SINGLE_LISTEN_UNSERIALIZED_ACCEPT 1
#define AP_SIG_GRACEFUL SIGUSR1
#define AP_SIG_GRACEFUL_STRING "SIGUSR1"
#define AP_SIG_GRACEFUL_SHORT USR1
#define HTTPD_ROOT "/usr/local/apache2"
#define SERVER_CONFIG_FILE "conf/httpd.conf"
#define AP_TYPES_CONFIG_FILE "conf/mime.types"
#define APACHE_MPM_DIR "server/mpm/prefork"


configure: exit 0
root@W2KPICASSO:/usr/src/cvs-source/httpd-2.0$

---------------------------------------------------------------------
To unsubscribe, e-mail: bugs-unsubscribe@httpd.apache.org
For additional commands, e-mail: bugs-help@httpd.apache.org


Mime
View raw message