httpd-apreq-dev mailing list archives

Site index · List index
Message view « Date » · « Thread »
Top « Date » · « Thread »
From VÁMOS Balázs <vamos.bal...@zuriel.hu>
Subject libapreq2 on RHEL3
Date Fri, 14 Jan 2005 22:11:40 GMT
Hi,

Has any of you ever installed libapreq2 on a RedHat EL 3 successfully?

I get the following error:


# make test
Making check in src
make[1]: Entering directory `/install/mason/libapreq2-2.03-dev/src'
make[1]: Leaving directory `/install/mason/libapreq2-2.03-dev/src'
Making check in env
make[1]: Entering directory `/install/mason/libapreq2-2.03-dev/env'
make  test_cgi
make[2]: Entering directory `/install/mason/libapreq2-2.03-dev/env'
/bin/sh ../libtool --mode=link gcc  -g -O2  -o test_cgi  test_cgi.o 
../src/libapreq2.la  /usr/lib/libapr-0.la  -lrt -lm -lcrypt -lnsl  -ldl 
  /usr/lib/libaprutil-0.la  -ldb -lexpat
gcc -g -O2 -o .libs/test_cgi test_cgi.o  ../src/.libs/libapreq2.so 
/usr/lib/libaprutil-0.so /usr/lib/libapr-0.so -lrt -lm -lcrypt -lnsl 
-ldl -lpthread -ldb /usr/lib/libexpat.so -Wl,--rpath -Wl,/etc/httpd/lib
../src/.libs/libapreq2.so: undefined reference to `apr_temp_dir_get'
collect2: ld returned 1 exit status
make[2]: *** [test_cgi] Error 1
make[2]: Leaving directory `/install/mason/libapreq2-2.03-dev/env'
make[1]: *** [check-am] Error 2
make[1]: Leaving directory `/install/mason/libapreq2-2.03-dev/env'
make: *** [check-recursive] Error 1


I have a RedHat EL 3 with the latest packages:
mod_perl-1.99_09-10.ent
httpd-2.0.46-44.ent
httpd-devel-2.0.46-44.ent


--

Balazs VAMOS

Mime
View raw message