httpd-apreq-dev mailing list archives

Site index · List index
Message view « Date » · « Thread »
Top « Date » · « Thread »
From "Eric J. Hansen" <ehan...@worldmachine.com>
Subject help with 2.04-dev build (failed tests: t/apreq/request, t/apreq/upload)
Date Wed, 13 Oct 2004 13:36:13 GMT
Hi folks,

I'm having problems installing libapreq2-2.04-dev.  (I have been using 2.02 for
a while with no problems, and it tests all OK.) I'm running Apache 2.0.52,
mod_perl 1.99_16, perl 5.8.2 on Linux OS kernel 2.4.21 (CRUX v1.2 distribution).
Perl modules that I've installed include ExtUtils-XSBuilder-0.27 and
ExtUtils-MakeMaker-6.21.

My configure line for 2.04-dev is:
# perl Makefile.PL --with-apache2-apxs=/var/httpd/bin/apxs

Basically, the make completes without any errors.

But during 'make test', I get the following errors that terminate the
testing process (this is just the tail of the test output):



....
[warning] result: OK
[warning] the client side drops 'root' permissions and becomes 'nobody'
/var/httpd/bin/httpd -d /usr/src/libapreq2-2.04-dev/glue/perl/t -f
/usr/src/libapreq2-2.04-dev/glue/perl/t/conf/httpd.conf -D APACHE2 -D
PERL_USEITHREADS
using Apache/2.0.52 (prefork MPM)

waiting 60 seconds for server to start: ..
waiting 60 seconds for server to start: ok (waited 1 secs)
server localhost:8529 started
t/apreq/big_input....ok
t/apreq/cgi..........skipped
       all skipped: no reason given
t/apreq/cookie.......ok
t/apreq/inherit......ok
t/apreq/request......NOK 16# Failed test 16 in t/apreq/request.t at line 39
t/apreq/request......FAILED test 16
       Failed 1/18 tests, 94.44% okay
t/apreq/upload.......dubious
       Test returned status 0 (wstat 13, 0xd)
DIED. FAILED tests 5-20
       Failed 16/20 tests, 20.00% okay
Failed Test       Stat Wstat Total Fail  Failed  List of Failed
-------------------------------------------------------------------------------
t/apreq/request.t               18    1   5.56%  16
t/apreq/upload.t     0    13    20   32 160.00%  5-20
1 test skipped.
Failed 2/6 test scripts, 66.67% okay. 17/70 subtests failed, 75.71% okay.
[warning] server localhost:8529 shutdown
[  error] error running tests (please examine t/logs/error_log)
make[1]: *** [run_tests] Error 1
make[1]: Leaving directory `/usr/src/libapreq2-2.04-dev/glue/perl'
make: *** [perl_test] Error 2



Any suggestions for getting this to test/build correctly?

One other tidbit...  my Apache is built with alot of stuff stripped out (perhaps
some of which is needed for apreq2's tests?)  Here's my httpd 2.0.52
configure line:

# ./configure --enable-rule=EAPI --enable-proxy --enable-headers
--enable-deflate \
--enable-file-cache --enable-cache --enable-disk-cache --enable-mem-cache \
--enable-ssl --with-ssl=/usr/src/openssl-0.9.7c --disable-cgi
--disable-autoindex \
--disable-asis --disable-cgid --disable-dir --disable-imap --disable-userdir \
--disable-include --disable-proxy-connect --disable-proxy-ftp
--disable-negotiation \
--prefix=/var/httpd

Will post the full output of 'make test' if needed.

many thanks,
Eric



Mime
View raw message