httpd-apreq-dev mailing list archives

Site index · List index
Message view « Date » · « Thread »
Top « Date » · « Thread »
From Joe Schaefer <joe+gm...@sunstarsys.com>
Subject FWD: FAIL libapreq-1.3 darwin-thread-multi-2level 7.0
Date Fri, 16 Apr 2004 18:43:42 GMT

This distribution has been tested as part of the cpan-testers
effort to test as many new uploads to CPAN as possible.  See
http://testers.cpan.org/

Please cc any replies to cpan-testers@perl.org to keep other
test volunteers informed and to prevent any duplicate effort.
	
--
This is an error report generated automatically by CPANPLUS,
version 0.049.

Below is the error stack during 'make test':

/usr/bin/perl -Iblib/arch -Iblib/lib \
t/TEST -clean
[warning] setting ulimit to allow core files
ulimit -c unlimited; /usr/bin/perl /Users/barry/.cpanplus/5.8.1/build/libapreq-1.3/t/TEST
-clean
[warning] dir '/usr/lib/apache/1.3' does not exist (while resolving '/usr/lib/apache/1.3/mod_auth_pg.so')
APACHE_TEST_GROUP= APACHE_TEST_HTTPD= APACHE_TEST_APXS= APACHE_TEST_USER= APACHE_TEST_PORT=
\
/usr/bin/perl -Iblib/arch -Iblib/lib \
t/TEST -bugreport -verbose=0 
[warning] setting ulimit to allow core files
ulimit -c unlimited; /usr/bin/perl /Users/barry/.cpanplus/5.8.1/build/libapreq-1.3/t/TEST
-bugreport -verbose=0
[warning] dir '/usr/lib/apache/1.3' does not exist (while resolving '/usr/lib/apache/1.3/mod_auth_pg.so')
/usr/sbin/httpd -d /Users/barry/.cpanplus/5.8.1/build/libapreq-1.3/t -f /Users/barry/.cpanplus/5.8.1/build/libapreq-1.3/t/conf/httpd.conf
-DAPACHE1 -DPERL_USEITHREADS
using Apache/1.3.27 

waiting 60 seconds for server to start: ..
waiting 60 seconds for server to start: ok (waited 1 secs)
server localhost:8529 started
t/apreq/big_input....# Failed test 1 in t/apreq/big_input.t at line 40
# Failed test 2 in t/apreq/big_input.t at line 40 fail #2
# Failed test 3 in t/apreq/big_input.t at line 40 fail #3
# Failed test 4 in t/apreq/big_input.t at line 40 fail #4
# Failed test 5 in t/apreq/big_input.t at line 40 fail #5
# Failed test 6 in t/apreq/big_input.t at line 40 fail #6
# Failed test 7 in t/apreq/big_input.t at line 40 fail #7
# Failed test 8 in t/apreq/big_input.t at line 40 fail #8
# Failed test 9 in t/apreq/big_input.t at line 40 fail #9
# Failed test 10 in t/apreq/big_input.t at line 63
# Failed test 11 in t/apreq/big_input.t at line 63 fail #2
# Failed test 12 in t/apreq/big_input.t at line 63 fail #3
# Failed test 13 in t/apreq/big_input.t at line 63 fail #4
# Failed test 14 in t/apreq/big_input.t at line 63 fail #5
# Failed test 15 in t/apreq/big_input.t at line 63 fail #6
# Failed test 16 in t/apreq/big_input.t at line 63 fail #7
# Failed test 17 in t/apreq/big_input.t at line 63 fail #8
# Failed test 18 in t/apreq/big_input.t at line 63 fail #9
# Failed test 19 in t/apreq/big_input.t at line 63 fail #10
# Failed test 20 in t/apreq/big_input.t at line 63 fail #11
dubious
	Test returned status 0 (wstat 13, 0xd)
DIED. FAILED tests 1-21
	Failed 21/21 tests, 0.00% okay
t/apreq/cookie.......# Failed test 1 in t/apreq/cookie.t at line 20
FAILED test 1
	Failed 1/1 tests, 0.00% okay
t/apreq/inherit......# Failed test 1 in t/apreq/inherit.t at line 11
FAILED test 1
	Failed 1/1 tests, 0.00% okay
t/apreq/request......# Failed test 1 in t/apreq/request.t at line 18
# Failed test 2 in t/apreq/request.t at line 26
FAILED tests 1-2
	Failed 2/2 tests, 0.00% okay
Failed Test         Stat Wstat Total Fail  Failed  List of Failed
-------------------------------------------------------------------------------
t/apreq/big_input.t    0    13    21   22 104.76%  1-21
t/apreq/cookie.t                   1    1 100.00%  1
t/apreq/inherit.t                  1    1 100.00%  1
t/apreq/request.t                  2    2 100.00%  1-2
[warning] server localhost:8529 shutdown
[warning] port 8529 still in use...
......done
[  error] error running tests (please examine t/logs/error_log)
make: *** [run_tests] Error 1


Additional comments:
--

Summary of my perl5 (revision 5.0 version 8 subversion 1 RC3) configuration:
  Platform:
    osname=darwin, osvers=7.0, archname=darwin-thread-multi-2level
    uname='darwin hampsten 7.0 darwin kernel version 6.0: fri jul 25 16:58:41 pdt 2003; root:xnu-344.frankd.rootsxnu-344.frankd~objrelease_ppc
power macintosh powerpc '
    config_args='-ds -e -Dprefix=/usr -Dccflags=-g  -pipe  -Dldflags=-Dman3ext=3pm -Duseithreads
-Duseshrplib'
    hint=recommended, useposix=true, d_sigaction=define
    usethreads=define use5005threads=undef useithreads=define usemultiplicity=define
    useperlio=define d_sfio=undef uselargefiles=define usesocks=undef
    use64bitint=undef use64bitall=undef uselongdouble=undef
    usemymalloc=n, bincompat5005=undef
  Compiler:
    cc='cc', ccflags ='-g -pipe -pipe -fno-common -DPERL_DARWIN -no-cpp-precomp -fno-strict-aliasing
-I/usr/local/include',
    optimize='-Os',
    cppflags='-no-cpp-precomp -g -pipe -pipe -fno-common -DPERL_DARWIN -no-cpp-precomp -fno-strict-aliasing
-I/usr/local/include'
    ccversion='', gccversion='3.3 20030304 (Apple Computer, Inc. build 1495)', gccosandvers=''
    intsize=4, longsize=4, ptrsize=4, doublesize=8, byteorder=4321
    d_longlong=define, longlongsize=8, d_longdbl=define, longdblsize=8
    ivtype='long', ivsize=4, nvtype='double', nvsize=8, Off_t='off_t', lseeksize=8
    alignbytes=8, prototype=define
  Linker and Libraries:
    ld='MACOSX_DEPLOYMENT_TARGET=10.3 cc', ldflags ='-L/usr/local/lib'
    libpth=/usr/local/lib /usr/lib
    libs=-ldbm -ldl -lm -lc
    perllibs=-ldl -lm -lc
    libc=/usr/lib/libc.dylib, so=dylib, useshrplib=true, libperl=libperl.dylib
    gnulibc_version=''
  Dynamic Linking:
    dlsrc=dl_dyld.xs, dlext=bundle, d_dlsymun=undef, ccdlflags=' '
    cccdlflags=' ', lddlflags='-bundle -undefined dynamic_lookup -L/usr/local/lib'


Mime
View raw message