httpd-apreq-dev mailing list archives

Site index · List index
Message view « Date » · « Thread »
Top « Date » · « Thread »
From Carl Brewer <c...@bl.echidna.id.au>
Subject latest CVS build & test errors
Date Mon, 21 Jul 2003 03:24:42 GMT

NetBSD 1.6.1 (i386)
Perl 5.8.0
Apache 2.0.47

The new "perlish" build needs $perl defined in Makefile.PL to
run

I'm seeing the following errors at make test time :

steel1: {283} make test
Making check in src
Making check in env
Making check in t
make  testall
source='testall.c' object='testall.o' libtool=no 
depfile='.deps/testall.Po' tmpdepfile='.deps/testall.TPo'  depmode=gcc 
/usr/pkg/bin/bash ../depcomp  gcc -DPACKAGE_NAME=\"libapreq\ -\ Apache\ 
Request\ Library\" -DPACKAGE_TARNAME=\"libapreq\" 
-DPACKAGE_VERSION=\"2.0\" -DPACKAGE_STRING=\"libapreq\ -\ Apache\ 
Request\ Library\ 2.0\" 
-DPACKAGE_BUGREPORT=\"apreq-dev@httpd.apache.org\" 
-DPACKAGE=\"libapreq\" -DVERSION=\"2.0\" -I. -I. -I../src 
-I/usr/local/apache2/include     -g -O2 -c `test -f 'testall.c' || echo 
'./'`testall.c
/usr/local/apache2/bin/apxs -c -p -lapreq -o testall  testall.o 
libapreq_tests.a -L../src
/usr/local/apache2/build/libtool --silent --mode=link gcc -o testall 
-lapreq  -L/usr/local/apache2/lib /usr/local/apache2/lib/libaprutil-0.la 
-lexpat   /usr/local/apache2/lib/libapr-0.la -lm -lcrypt -lresolv 
testall.o libapreq_tests.a -L../src
/usr/local/apache2/lib/libapreq.so: warning: tempnam() possibly used 
unsafely, use mkstemp() or mkdtemp()
t/testall -v
All APREQ Tests:
     Cookie:                   ....
     Param:                    ..F
     Parsers:                  ..

9 tests run:  8 passed, 1 failed, 0 not implemented.

Failed tests in Param:
1) string_decoding_in_place: expected
---->
bend it like beckham
<----
but saw
---->

<----

*** Error code 1

Stop.
make: stopped in /data/src/httpd-apreq-2


make perl_glue seems fine

but :

steel1: {287} make perl_test
cd glue/perl; make test
/usr/local/perl-5.8.0/bin/perl -Iblib/arch -Iblib/lib  t/TEST -clean
APACHE_USER= APACHE_GROUP= APACHE_PORT= APACHE= APXS= 
/usr/local/perl-5.8.0/bin/perl -Iblib/arch -Iblib/lib  t/TEST -verbose=0
/usr/local/apache2/bin/httpd  -d /data/src/httpd-apreq-2/glue/perl/t -f 
/data/src/httpd-apreq-2/glue/perl/t/conf/httpd.conf -DAPACHE2
using Apache/2.0.47 (prefork MPM)

waiting for server to start: ..
waiting for server to start: ok (waited 1 secs)
server localhost:8529 started
apreq/big_input....NOK 1# Failed test 1 in apreq/big_input.t at line 40
apreq/big_input....NOK 2# Failed test 2 in apreq/big_input.t at line 40 
fail #2
apreq/big_input....NOK 3# Failed test 3 in apreq/big_input.t at line 40 
fail #3
apreq/big_input....NOK 4# Failed test 4 in apreq/big_input.t at line 40 
fail #4
apreq/big_input....NOK 5# Failed test 5 in apreq/big_input.t at line 40 
fail #5
apreq/big_input....NOK 6# Failed test 6 in apreq/big_input.t at line 40 
fail #6
apreq/big_input....NOK 7# Failed test 7 in apreq/big_input.t at line 40 
fail #7
apreq/big_input....NOK 8# Failed test 8 in apreq/big_input.t at line 40 
fail #8
apreq/big_input....NOK 9# Failed test 9 in apreq/big_input.t at line 40 
fail #9
apreq/big_input....NOK 10# Failed test 10 in apreq/big_input.t at line 63
apreq/big_input....NOK 11# Failed test 11 in apreq/big_input.t at line 
63 fail #2
apreq/big_input....NOK 12# Failed test 12 in apreq/big_input.t at line 
63 fail #3
apreq/big_input....NOK 13# Failed test 13 in apreq/big_input.t at line 
63 fail #4
apreq/big_input....NOK 14# Failed test 14 in apreq/big_input.t at line 
63 fail #5
apreq/big_input....NOK 15# Failed test 15 in apreq/big_input.t at line 
63 fail #6
apreq/big_input....NOK 16# Failed test 16 in apreq/big_input.t at line 
63 fail #7
apreq/big_input....NOK 17# Failed test 17 in apreq/big_input.t at line 
63 fail #8
apreq/big_input....NOK 18# Failed test 18 in apreq/big_input.t at line 
63 fail #9
apreq/big_input....NOK 19# Failed test 19 in apreq/big_input.t at line 
63 fail #10
apreq/big_input....NOK 20# Failed test 20 in apreq/big_input.t at line 
63 fail #11
apreq/big_input....NOK 21# Failed test 21 in apreq/big_input.t at line 
63 fail #12
apreq/big_input....FAILED tests 1-21
         Failed 21/21 tests, 0.00% okay
apreq/cookie.......NOK 1# Failed test 1 in apreq/cookie.t at line 19
apreq/cookie.......NOK 2# Failed test 2 in apreq/cookie.t at line 28
apreq/cookie.......NOK 3# Failed test 3 in apreq/cookie.t at line 38
apreq/cookie.......NOK 4# Failed test 4 in apreq/cookie.t at line 50
apreq/cookie.......NOK 5# Failed test 5 in apreq/cookie.t at line 59
apreq/cookie.......FAILED tests 1-5
         Failed 5/5 tests, 0.00% okay
apreq/inherit......NOK 1# Failed test 1 in apreq/inherit.t at line 12
apreq/inherit......NOK 2# Failed test 2 in apreq/inherit.t at line 13
apreq/inherit......NOK 3# Failed test 3 in apreq/inherit.t at line 14
apreq/inherit......NOK 4# Failed test 4 in apreq/inherit.t at line 15
apreq/inherit......FAILED tests 1-4
         Failed 4/4 tests, 0.00% okay
apreq/request......NOK 1# Failed test 1 in apreq/request.t at line 18
apreq/request......NOK 2# Failed test 2 in apreq/request.t at line 26
apreq/request......FAILED tests 1-2
         Failed 2/2 tests, 0.00% okay
Failed Test       Stat Wstat Total Fail  Failed  List of Failed
-------------------------------------------------------------------------------
apreq/big_input.t               21   21 100.00%  1-21
apreq/cookie.t                   5    5 100.00%  1-5
apreq/inherit.t                  4    4 100.00%  1-4
apreq/request.t                  2    2 100.00%  1-2
*** server localhost:8529 shutdown
!!! error running tests (please examine t/logs/error_log)
*** Error code 1

Stop.
make: stopped in /data/src/httpd-apreq-2/glue/perl
*** Error code 1

Stop.
make: stopped in /data/src/httpd-apreq-2


I'll look deeper into it tomorrow.

Carl




Mime
View raw message