httpd-apreq-dev mailing list archives

Site index · List index
Message view « Date » · « Thread »
Top « Date » · « Thread »
From Carl Brewer <c...@bl.echidna.id.au>
Subject perl make errors
Date Thu, 17 Jul 2003 09:10:51 GMT

I'm building on NetBSD 1.6.1, with perl 5.8.0 and a very recent
CVS pull of mp2 (2 days old)

a CVS up from today for httpd-apreq-2 does the following :

make perl_test
cd glue/perl; make test
/usr/bin/perl -Iblib/arch -Iblib/lib  t/TEST -clean
APACHE_USER= APACHE_GROUP= APACHE_PORT= APACHE= APXS=  /usr/bin/perl 
-Iblib/arch -Iblib/lib  t/TEST -verbose=0
*** root mode: changing the fs ownership to 'nobody' (32767:39)
/usr/local/apache2/bin/httpd  -d /data/src/httpd-apreq-2/glue/perl/t -f 
/data/src/httpd-apreq-2/glue/perl/t/conf/httpd.conf -DAPACHE2
using Apache/2.0.47 (prefork MPM)

waiting for server to start: ..
waiting for server to start: ok (waited 1 secs)
server localhost:8529 started
apreq/big_input....NOK 1# Failed test 1 in apreq/big_input.t at line 40
apreq/big_input....NOK 2# Failed test 2 in apreq/big_input.t at line 40 
fail #2
apreq/big_input....NOK 3# Failed test 3 in apreq/big_input.t at line 40 
fail #3
apreq/big_input....NOK 4# Failed test 4 in apreq/big_input.t at line 40 
fail #4
apreq/big_input....NOK 5# Failed test 5 in apreq/big_input.t at line 40 
fail #5
apreq/big_input....NOK 6# Failed test 6 in apreq/big_input.t at line 40 
fail #6
apreq/big_input....NOK 7# Failed test 7 in apreq/big_input.t at line 40 
fail #7
apreq/big_input....NOK 8# Failed test 8 in apreq/big_input.t at line 40 
fail #8
apreq/big_input....NOK 9# Failed test 9 in apreq/big_input.t at line 40 
fail #9
apreq/big_input....NOK 10# Failed test 10 in apreq/big_input.t at line 63
apreq/big_input....NOK 11# Failed test 11 in apreq/big_input.t at line 
63 fail #2
apreq/big_input....NOK 12# Failed test 12 in apreq/big_input.t at line 
63 fail #3
apreq/big_input....NOK 13# Failed test 13 in apreq/big_input.t at line 
63 fail #4
apreq/big_input....NOK 14# Failed test 14 in apreq/big_input.t at line 
63 fail #5
apreq/big_input....NOK 15# Failed test 15 in apreq/big_input.t at line 
63 fail #6
apreq/big_input....NOK 16# Failed test 16 in apreq/big_input.t at line 
63 fail #7
apreq/big_input....NOK 17# Failed test 17 in apreq/big_input.t at line 
63 fail #8
apreq/big_input....NOK 18# Failed test 18 in apreq/big_input.t at line 
63 fail #9
apreq/big_input....NOK 19# Failed test 19 in apreq/big_input.t at line 
63 fail #10
apreq/big_input....NOK 20# Failed test 20 in apreq/big_input.t at line 
63 fail #11
apreq/big_input....NOK 21# Failed test 21 in apreq/big_input.t at line 
63 fail #12
apreq/big_input....FAILED tests 1-21
         Failed 21/21 tests, 0.00% okay
apreq/cookie.......NOK 1# Failed test 1 in apreq/cookie.t at line 19
apreq/cookie.......NOK 2# Failed test 2 in apreq/cookie.t at line 28
apreq/cookie.......NOK 3# Failed test 3 in apreq/cookie.t at line 38
apreq/cookie.......NOK 4# Failed test 4 in apreq/cookie.t at line 50
apreq/cookie.......NOK 5# Failed test 5 in apreq/cookie.t at line 59
apreq/cookie.......FAILED tests 1-5
         Failed 5/5 tests, 0.00% okay
apreq/inherit......NOK 1# Failed test 1 in apreq/inherit.t at line 12
apreq/inherit......NOK 2# Failed test 2 in apreq/inherit.t at line 13
apreq/inherit......NOK 3# Failed test 3 in apreq/inherit.t at line 14
apreq/inherit......NOK 4# Failed test 4 in apreq/inherit.t at line 15
apreq/inherit......FAILED tests 1-4
         Failed 4/4 tests, 0.00% okay
apreq/request......NOK 1# Failed test 1 in apreq/request.t at line 18
apreq/request......NOK 2# Failed test 2 in apreq/request.t at line 26
apreq/request......FAILED tests 1-2
         Failed 2/2 tests, 0.00% okay
Failed Test       Stat Wstat Total Fail  Failed  List of Failed
-------------------------------------------------------------------------------
apreq/big_input.t               21   21 100.00%  1-21
apreq/cookie.t                   5    5 100.00%  1-5
apreq/inherit.t                  4    4 100.00%  1-4
apreq/request.t                  2    2 100.00%  1-2
*** server localhost:8529 shutdown
!!! error running tests (please examine t/logs/error_log)
*** Error code 1

Stop.
make: stopped in /data/src/httpd-apreq-2/glue/perl
*** Error code 1

Stop.
make: stopped in /data/src/httpd-apreq-2


The C stuff compiles just fine but tests badly :

steel1: {36} make test
Making check in src
Making check in env
Making check in t
make  testall
`testall' is up to date.
t/testall -v
All APREQ Tests:
     Cookie:                   ....
     Param:                    ..
     Parsers:                  ..

8 tests run:  8 passed, 0 failed, 0 not implemented.

cd env; make test
perl t/TEST
==> inheriting config file: /usr/local/apache2/conf/httpd.conf
==> inheriting config file: /usr/local/apache2/conf/ssl.conf
==> Found: php4_module => mod_php4.c
==> LoadModule php4_module mod_php4.c
==> Found: perl_module => mod_perl.c
==> LoadModule perl_module mod_perl.c
==> Found: apreq_module => mod_apreq.c
==> LoadModule apreq_module mod_apreq.c
==> generating ../c-modules/apache_httpd_test.h
==> WRITING 
/data/src/httpd-apreq-2/env/c-modules/apreq_access_test/Makefile for 
mod_apreq_access_test
==> WRITING 
/data/src/httpd-apreq-2/env/c-modules/apreq_request_test/Makefile for 
mod_apreq_request_test
==> cd /data/src/httpd-apreq-2/env/c-modules && make all
==> WRITING httpd.conf with mod_apreq_access_test, mod_apreq_request_test
==> generating conf/httpd.conf
==> generating conf/apache_test_config.pm
==> saving config data to apache_test_config.pm
*** root mode: changing the fs ownership to 'nobody' (32767:39)
/usr/local/apache2/bin/httpd  -d /data/src/httpd-apreq-2/env/t -f 
/data/src/httpd-apreq-2/env/t/conf/httpd.conf -DAPACHE2
using Apache/2.0.47 (prefork MPM)

waiting for server to start: ..
waiting for server to start: ok (waited 1 secs)
server localhost:8529 started
request....NOK 1# Failed test 1 in request.t at line 12
request....NOK 2# Failed test 2 in request.t at line 15
request....NOK 3# Failed test 3 in request.t at line 12 fail #2
request....NOK 4# Failed test 4 in request.t at line 15 fail #2
request....NOK 5# Failed test 5 in request.t at line 20
request....NOK 6# Failed test 6 in request.t at line 25
request....FAILED tests 1-6
         Failed 6/6 tests, 0.00% okay
Failed Test Stat Wstat Total Fail  Failed  List of Failed
-------------------------------------------------------------------------------
request.t                  6    6 100.00%  1-6
*** server localhost:8529 shutdown
!!! error running tests (please examine t/logs/error_log)
*** Error code 1

Stop.
make: stopped in /data/src/httpd-apreq-2/env
*** Error code 1

Stop.
make: stopped in /data/src/httpd-apreq-2
Here's the two error logs :

steel1: {40} more httpd-apreq-2/env/t/logs/error_log
[Thu Jul 17 19:07:18 2003] [info] Init: Initializing OpenSSL library
[Thu Jul 17 19:07:18 2003] [info] Init: Seeding PRNG with 0 bytes of entropy
[Thu Jul 17 19:07:18 2003] [info] Init: Generating temporary RSA private 
keys (5
12/1024 bits)
[Thu Jul 17 19:07:19 2003] [info] Init: Generating temporary DH 
parameters (512/
1024 bits)
[Thu Jul 17 19:07:19 2003] [warn] Init: Session Cache is not configured 
[hint: S
SLSessionCache]
[Thu Jul 17 19:07:19 2003] [info] Init: Initializing (virtual) servers 
for SSL
[Thu Jul 17 19:07:19 2003] [info] Server: Apache/2.0.47, Interface: 
mod_ssl/2.0.
47, Library: OpenSSL/0.9.7b
[Thu Jul 17 19:07:19 2003] [info] Init: Initializing OpenSSL library
[Thu Jul 17 19:07:19 2003] [info] Init: Seeding PRNG with 0 bytes of entropy
[Thu Jul 17 19:07:19 2003] [info] Init: Generating temporary RSA private 
keys (5
12/1024 bits)
[Thu Jul 17 19:07:20 2003] [info] Init: Generating temporary DH 
parameters (512/
1024 bits)
[Thu Jul 17 19:07:20 2003] [info] Init: Initializing (virtual) servers 
for SSL
[Thu Jul 17 19:07:20 2003] [info] Server: Apache/2.0.47, Interface: 
mod_ssl/2.0.
47, Library: OpenSSL/0.9.7b
[Thu Jul 17 19:07:20 2003] [notice] Apache/2.0.47 (Unix) 
mod_perl/1.99_10-dev Pe
rl/v5.8.0 PHP/4.3.2 mod_ssl/2.0.47 OpenSSL/0.9.7b configured -- resuming 
normal
operations
[Thu Jul 17 19:07:20 2003] [info] Server built: Jul 10 2003 10:10:41
[Thu Jul 17 19:07:20 2003] [debug] prefork.c(1037): AcceptMutex: sysvsem 
(defaul
t: sysvsem)
[Thu Jul 17 19:07:21 2003] [error] server reached MaxClients setting, 
consider r
aising the MaxClients setting
[Thu Jul 17 19:07:22 2003] [info] removed PID file 
/data/src/httpd-apreq-2/env/t
/logs/httpd.pid (pid=13088)
[Thu Jul 17 19:07:22 2003] [notice] caught SIGTERM, shutting down

steel1: {47} more glue/perl/t/logs/error_log
[Thu Jul 17 19:00:41 2003] [info] Init: Initializing OpenSSL library
[Thu Jul 17 19:00:41 2003] [info] Init: Seeding PRNG with 0 bytes of entropy
[Thu Jul 17 19:00:41 2003] [info] Init: Generating temporary RSA private 
keys (5
12/1024 bits)
[Thu Jul 17 19:00:41 2003] [info] Init: Generating temporary DH 
parameters (512/
1024 bits)
[Thu Jul 17 19:00:41 2003] [warn] Init: Session Cache is not configured 
[hint: S
SLSessionCache]
[Thu Jul 17 19:00:41 2003] [info] Init: Initializing (virtual) servers 
for SSL
[Thu Jul 17 19:00:41 2003] [info] Server: Apache/2.0.47, Interface: 
mod_ssl/2.0.
47, Library: OpenSSL/0.9.7b
[Thu Jul 17 19:00:41 2003] [info] Init: Initializing OpenSSL library
[Thu Jul 17 19:00:41 2003] [info] Init: Seeding PRNG with 0 bytes of entropy
[Thu Jul 17 19:00:41 2003] [info] Init: Generating temporary RSA private 
keys (5
12/1024 bits)
[Thu Jul 17 19:00:42 2003] [info] Init: Generating temporary DH 
parameters (512/
1024 bits)
[Thu Jul 17 19:00:42 2003] [info] Init: Initializing (virtual) servers 
for SSL
[Thu Jul 17 19:00:42 2003] [info] Server: Apache/2.0.47, Interface: 
mod_ssl/2.0.
47, Library: OpenSSL/0.9.7b
[Thu Jul 17 19:00:42 2003] [notice] Apache/2.0.47 (Unix) 
mod_perl/1.99_10-dev Pe
rl/v5.8.0 PHP/4.3.2 mod_ssl/2.0.47 OpenSSL/0.9.7b configured -- resuming 
normal
operations
[Thu Jul 17 19:00:42 2003] [info] Server built: Jul 10 2003 10:10:41
[Thu Jul 17 19:00:42 2003] [debug] prefork.c(1037): AcceptMutex: sysvsem 
(defaul
t: sysvsem)
[Thu Jul 17 19:00:43 2003] [error] server reached MaxClients setting, 
consider r
aising the MaxClients setting
[Thu Jul 17 19:00:49 2003] [info] removed PID file 
/data/src/httpd-apreq-2/glue/
perl/t/logs/httpd.pid (pid=12927)
[Thu Jul 17 19:00:49 2003] [notice] caught SIGTERM, shutting down




What other debugging info do you need?

Carl





Mime
View raw message