httpd-apreq-dev mailing list archives

Site index · List index
Message view « Date » · « Thread »
Top « Date » · « Thread »
From Jim Winstead <j...@apache.org>
Subject [root@duck.gondwana.com.au: FAIL libapreq-1.1 i386-linux 2.4.17-0.13smp]
Date Fri, 14 Mar 2003 01:06:53 GMT
----- Forwarded message from root <root@duck.gondwana.com.au> -----

Date: Mon, 10 Mar 2003 23:14:17 +1100
Subject: FAIL libapreq-1.1 i386-linux 2.4.17-0.13smp
From: root@duck.gondwana.com.au (root)
To: cpan-testers@perl.org
Cc: JIMW@cpan.org

This distribution has been tested as part of the cpan-testers
effort to test as many new uploads to CPAN as possible.  See
http://testers.cpan.org/

Please cc any replies to cpan-testers@perl.org to keep other
test volunteers informed and to prevent any duplicate effort.
	
--
This is an error report generated automatically by CPANPLUS,
version 0.042.

Below is the error stack during 'make test':

make[1]: Entering directory `/root/.cpanplus/5.6.1/build/libapreq-1.1/c'
make[1]: Leaving directory `/root/.cpanplus/5.6.1/build/libapreq-1.1/c'
make[1]: Entering directory `/root/.cpanplus/5.6.1/build/libapreq-1.1/Request'
make[1]: Leaving directory `/root/.cpanplus/5.6.1/build/libapreq-1.1/Request'
make[1]: Entering directory `/root/.cpanplus/5.6.1/build/libapreq-1.1/Cookie'
make[1]: Leaving directory `/root/.cpanplus/5.6.1/build/libapreq-1.1/Cookie'
PERL_DL_NONLAZY=1 /usr/bin/perl "-MExtUtils::Command::MM" "-e" "test_harness(0, 'blib/lib',
'blib/arch')" t/*.t
t/cookie.....skipped
        all skipped: no reason given
t/inherit....FAILED test 1
	Failed 1/1 tests, 0.00% okay
t/request....FAILED tests 1-10
	Failed 10/10 tests, 0.00% okay
Failed Test Stat Wstat Total Fail  Failed  List of Failed
-----------------------------------------------------------------------------------------------------------------------
t/inherit.t                1    1 100.00%  1
t/request.t               10   10 100.00%  1-10
1 test skipped.
Failed 2/3 test scripts, 33.33% okay. 11/11 subtests failed, 0.00% okay.
make: *** [test_dynamic] Error 11


Additional comments:

--

Summary of my perl5 (revision 5.0 version 6 subversion 1) configuration:
  Platform:
    osname=linux, osvers=2.4.17-0.13smp, archname=i386-linux
    uname='linux daffy.perf.redhat.com 2.4.17-0.13smp #1 smp fri feb 1 10:30:48 est 2002 i686
unknown '
    config_args='-des -Doptimize=-O2 -march=i386 -mcpu=i686 -Dcc=gcc -Dcf_by=Red Hat, Inc.
-Dcccdlflags=-fPIC -Dinstallprefix=/usr -Dprefix=/usr -Darchname=i386-linux -Uusethreads -Uuseithreads
-Uuselargefiles -Dd_dosuid -Dd_semctl_semun -Di_db -Di_ndbm -Di_gdbm -Di_shadow -Di_syslog
-Dman3ext=3pm -Dlocincpth='
    hint=recommended, useposix=true, d_sigaction=define
    usethreads=undef use5005threads=undef useithreads=undef usemultiplicity=undef
    useperlio=undef d_sfio=undef uselargefiles=undef usesocks=undef
    use64bitint=undef use64bitall=undef uselongdouble=undef
  Compiler:
    cc='gcc', ccflags ='-fno-strict-aliasing -I/usr/local/include',
    optimize='-O2 -march=i386 -mcpu=i686',
    cppflags='-fno-strict-aliasing -I/usr/local/include'
    ccversion='', gccversion='2.96 20000731 (Red Hat Linux 7.1 2.96-98)', gccosandvers=''
    intsize=4, longsize=4, ptrsize=4, doublesize=8, byteorder=1234
    d_longlong=define, longlongsize=8, d_longdbl=define, longdblsize=12
    ivtype='long', ivsize=4, nvtype='double', nvsize=8, Off_t='off_t', lseeksize=4
    alignbytes=4, usemymalloc=n, prototype=define
  Linker and Libraries:
    ld='gcc', ldflags =' -L/usr/local/lib'
    libpth=/usr/local/lib /lib /usr/lib
    libs=-lnsl -ldl -lm -lc -lcrypt -lutil
    perllibs=-lnsl -ldl -lm -lc -lcrypt -lutil
    libc=/lib/libc-2.2.4.so, so=so, useshrplib=false, libperl=libperl.a
  Dynamic Linking:
    dlsrc=dl_dlopen.xs, dlext=so, d_dlsymun=undef, ccdlflags='-rdynamic'
    cccdlflags='-fPIC', lddlflags='-shared -L/usr/local/lib'

----- End forwarded message -----

Mime
View raw message