httpd-apreq-dev mailing list archives

Site index · List index
Message view « Date » · « Thread »
Top « Date » · « Thread »
From Jim Winstead <j...@apache.org>
Subject [alian@cpan.org: FAIL libapreq-1.1 i686-linux-thread-multi-64all-ld 2.4.20]
Date Sun, 09 Mar 2003 17:07:07 GMT
----- Forwarded message from alian <alian@cpan.org> -----

Date: Sun, 9 Mar 2003 01:38:29 +0100
Cc: JIMW@cpan.org
Subject: FAIL libapreq-1.1 i686-linux-thread-multi-64all-ld 2.4.20
To: cpan-testers@perl.org
From: alian@cpan.org (alian)

This distribution has been tested as part of the cpan-testers
effort to test as many new uploads to CPAN as possible.  See
http://testers.cpan.org/

Please cc any replies to cpan-testers@perl.org to keep other
test volunteers informed and to prevent any duplicate effort.
	
--
This is an error report generated automatically by CPANPLUS,
version 0.042.

Below is the error stack during 'make test échoué! - aucun fichier ou répertoire de ce
type dans cpanplus::internals::make::_make le sun mar  9 01:38:00 2003':

make[1]: Entre dans le répertoire `/home/alian/.cpanplus/5.8.0/build/libapreq-1.1/c'
make[1]: Quitte le répertoire `/home/alian/.cpanplus/5.8.0/build/libapreq-1.1/c'
make[1]: Entre dans le répertoire `/home/alian/.cpanplus/5.8.0/build/libapreq-1.1/Request'
make[1]: Quitte le répertoire `/home/alian/.cpanplus/5.8.0/build/libapreq-1.1/Request'
make[1]: Entre dans le répertoire `/home/alian/.cpanplus/5.8.0/build/libapreq-1.1/Cookie'
make[1]: Quitte le répertoire `/home/alian/.cpanplus/5.8.0/build/libapreq-1.1/Cookie'
PERL_DL_NONLAZY=1 /usr/local/perl-5.8.0/bin/perl "-MExtUtils::Command::MM" "-e" "test_harness(0,
'blib/lib', 'blib/arch')" t/*.t
t/cookie.....skipped
        all skipped: no reason given
t/inherit....FAILED test 1
	Failed 1/1 tests, 0.00% okay
t/request....FAILED tests 1-10
	Failed 10/10 tests, 0.00% okay
Failed Test Stat Wstat Total Fail  Failed  List of Failed
-------------------------------------------------------------------------------
t/inherit.t                1    1 100.00%  1
t/request.t               10   10 100.00%  1-10
1 test skipped.
Failed 2/3 test scripts, 33.33% okay. 11/11 subtests failed, 0.00% okay.
make: *** [test_dynamic] Erreur 29


Additional comments:

--

Summary of my perl5 (revision 5.0 version 8 subversion 0) configuration:
  Platform:
    osname=linux, osvers=2.4.20, archname=i686-linux-thread-multi-64all-ld
    uname='linux saturne.alianet 2.4.20 #81 smp jeu déc 12 18:42:40 cet 2002 i686 unknown
'
    config_args='-Duseithreads -Duse64bitall -Duselongdouble -Duseshrplib -Dcf_email=alian@cpan.org
-Dprefix=/usr/local/perl-5.8.0 -des'
    hint=recommended, useposix=true, d_sigaction=define
    usethreads=define use5005threads=undef useithreads=define usemultiplicity=define
    useperlio=define d_sfio=undef uselargefiles=define usesocks=undef
    use64bitint=define use64bitall=undef uselongdouble=define
    usemymalloc=n, bincompat5005=undef
  Compiler:
    cc='cc', ccflags ='-D_REENTRANT -D_GNU_SOURCE -fno-strict-aliasing -I/usr/local/include
-D_LARGEFILE_SOURCE -D_FILE_OFFSET_BITS=64 -I/usr/include/gdbm',
    optimize='-O2',
    cppflags='-D_REENTRANT -D_GNU_SOURCE -fno-strict-aliasing -I/usr/local/include -I/usr/include/gdbm'
    ccversion='', gccversion='2.96 20000731 (Mandrake Linux 8.1 2.96-0.62mdk)', gccosandvers=''
    intsize=4, longsize=4, ptrsize=4, doublesize=8, byteorder=12345678
    d_longlong=define, longlongsize=8, d_longdbl=define, longdblsize=12
    ivtype='long long', ivsize=8, nvtype='long double', nvsize=12, Off_t='off_t', lseeksize=8
    alignbytes=4, prototype=define
  Linker and Libraries:
    ld='cc', ldflags =' -L/usr/local/lib'
    libpth=/usr/local/lib /lib /usr/lib
    libs=-lnsl -lgdbm -ldl -lm -lpthread -lc -lcrypt -lutil
    perllibs=-lnsl -ldl -lm -lpthread -lc -lcrypt -lutil
    libc=/lib/libc-2.2.4.so, so=so, useshrplib=true, libperl=libperl.so
    gnulibc_version='2.2.4'
  Dynamic Linking:
    dlsrc=dl_dlopen.xs, dlext=so, d_dlsymun=undef, ccdlflags='-rdynamic -Wl,-rpath,/usr/local/perl-5.8.0/lib/5.8.0/i686-linux-thread-multi-64all-ld/CORE'
    cccdlflags='-fpic', lddlflags='-shared -L/usr/local/lib'

----- End forwarded message -----

Mime
View raw message