httpd-apreq-dev mailing list archives

Site index · List index
Message view « Date » · « Thread »
Top « Date » · « Thread »
From Geoffrey Young <gyo...@laserlink.net>
Subject RE: bleedperl problems
Date Mon, 11 Jun 2001 14:50:23 GMT


> -----Original Message-----
> From: Joe Schaefer [mailto:joe@sunstarsys.com]
> Sent: Monday, June 11, 2001 10:01 AM
> To: Geoffrey Young
> Cc: apreq-dev@httpd.apache.org
> Subject: Re: bleedperl problems
> 
> 
> Geoffrey Young <gyoung@laserlink.net> writes:
> 
> > hi all...
> > 
> > I've been getting the following warnings in my libapreq 
> build with bleedperl
> > for a while now... thought I'd report them just in case - 
> my mod_perl tests
> > have been failing for a similar period.
> > 
> > --Geoff
> 
> > -DXS_VERSION=\"0.3201\" -fpic
> > -I/src/bleedperl/lib/5.7.1/i686-linux-thread-multi/CORE  Request.c
> > Request.xs: In function `upload_hook':
> > Request.xs:189: warning: unused variable `my_perl'
> > Request.xs:209: warning: unused variable `my_perl'
> 
> This warning is weird- I think it is generated from the 
> ENTER/LEAVE XS 
> macros in the upload_hook code. The rest of them seem 
> reasonable, though.
> 
> > usemultiplicity=define
> >     useperlio=define d_sfio=undef uselargefiles=define 
> usesocks=undef
> >     use64bitint=undef use64bitall=undef uselongdouble=undef
> 
> The usemultiplicity flag might have something to do with it. 

I don't remember setting that explicity - what does it control?  this is a
RH6.2 box with a 2.2.14 kernel

>  I'm
> interested in knowing how/where libapreq fails on this setup- can
> you get modperl to build and post the modperl test suite results?

I can build it and run it just fine - everything seems to function properly.
test errors out like crazy, which I've seen
happen if it sees libapreq but libapreq is broken.

here's what the test suite looks like (forgive the extensive output)

--Geoff

httpd listening on port 8529
will write error_log to: t/logs/error_log
letting apache warm up...\c
done
/usr/bin/perl t/TEST 0
modules/actions.....ok

modules/cgi.........ok

modules/constants...ok

modules/cookie......ok

modules/embperl.....skipped test on this platform
modules/eperl.......skipped test on this platform
modules/file........ok

modules/httpdconf...ok

modules/include.....ok

modules/log.........ok

modules/module......ok

modules/perlrun.....ok

modules/perlrunxs...skipped test on this platform
modules/psections...ok

modules/request.....Use of uninitialized value in numeric eq (==) at
modules/request.t line 147.
Use of uninitialized value in concatenation (.) or string at
modules/request.t line 147.
Use of uninitialized value in numeric eq (==) at modules/request.t line 149.
Use of uninitialized value in numeric eq (==) at modules/request.t line 147.
Use of uninitialized value in concatenation (.) or string at
modules/request.t line 147.
Use of uninitialized value in numeric eq (==) at modules/request.t line 149.
Use of uninitialized value in numeric eq (==) at modules/request.t line 147.
Use of uninitialized value in concatenation (.) or string at
modules/request.t line 147.
Use of uninitialized value in numeric eq (==) at modules/request.t line 149.
Use of uninitialized value in numeric eq (==) at modules/request.t line 147.
Use of uninitialized value in concatenation (.) or string at
modules/request.t line 147.
Use of uninitialized value in numeric eq (==) at modules/request.t line 149.
modules/request.....FAILED tests 3-10

        Failed 8/10 tests, 20.00% okay
modules/sandwich....skipped test on this platform
modules/src.........ok

modules/ssi.........skipped test on this platform
modules/stage.......skipped test on this platform
modules/status......fetch /perl/perl-status failed!
modules/status......dubious

        Test returned status 111 (wstat 28416, 0x6f00)
DIED. FAILED tests 1-10
        Failed 10/10 tests, 0.00% okay
modules/symbol......FAILED before any test output arrived
modules/uri.........FAILED before any test output arrived
modules/util........FAILED before any test output arrived
internal/api........FAILED before any test output arrived
internal/auth.......FAILED test 1

        Failed 1/2 tests, 50.00% okay
internal/croak......FAILED tests 1, 3-4, 6-7, 9-10, 12

        Failed 8/12 tests, 33.33% okay
internal/dirmagic...FAILED before any test output arrived
internal/error......ok

internal/headers....Argument "" isn't numeric in numeric eq (==) at
internal/headers.t line 29.
Argument "" isn't numeric in numeric eq (==) at internal/headers.t line 29.
Argument "" isn't numeric in numeric eq (==) at internal/headers.t line 29.
Argument "" isn't numeric in numeric eq (==) at internal/headers.t line 29.
Use of uninitialized value in string eq at internal/headers.t line 42.
Use of uninitialized value in string eq at internal/headers.t line 48.
Use of uninitialized value in string eq at internal/headers.t line 54.
internal/headers....FAILED tests 1-11, 13

        Failed 12/13 tests, 7.69% okay
internal/hooks......500 (Internal Server Error) Can't connect to
localhost:8529 (connect: Connection refused)
Client-Date: Mon, 11 Jun 2001 14:43:17 GMT



internal/hooks......dubious

        Test returned status 111 (wstat 28416, 0x6f00)
internal/http-get...Internal Server Error
internal/http-get...dubious

        Test returned status 111 (wstat 28416, 0x6f00)
DIED. FAILED tests 1-16
        Failed 16/16 tests, 0.00% okay
internal/http-post..Internal Server Error
internal/http-post..dubious

        Test returned status 111 (wstat 28416, 0x6f00)
DIED. FAILED tests 1-7
        Failed 7/7 tests, 0.00% okay
internal/proxy......ok

internal/redirect...FAILED tests 1-3, 5

        Failed 4/5 tests, 20.00% okay
internal/rwrite.....FAILED tests 1-2

        Failed 2/2 tests, 0.00% okay
internal/stacked....can't open http://localhost:8529//perl/stacked
internal/stacked....dubious

        Test returned status 111 (wstat 28416, 0x6f00)
internal/table......FAILED before any test output arrived
internal/taint......Internal Server Error
internal/taint......dubious

        Test returned status 111 (wstat 28416, 0x6f00)
DIED. FAILED tests 1-3
        Failed 3/3 tests, 0.00% okay
Failed Test          Stat Wstat Total Fail  Failed  List of Failed
----------------------------------------------------------------------------
---
internal/api.t                     ??   ??       %  ??
internal/auth.t                     2    1  50.00%  1
internal/croak.t                   12    8  66.67%  1 3-4 6-7 9-10 12
internal/dirmagic.t                ??   ??       %  ??
internal/headers.t                 13   12  92.31%  1-11 13
internal/hooks.t      111 28416    ??   ??       %  ??
internal/http-get.t   111 28416    16   16 100.00%  1-16
internal/http-post.t  111 28416     7    7 100.00%  1-7
internal/redirect.t                 5    4  80.00%  1-3 5
internal/rwrite.t                   2    2 100.00%  1-2
internal/stacked.t    111 28416    ??   ??       %  ??
internal/table.t                   ??   ??       %  ??
internal/taint.t      111 28416     3    3 100.00%  1-3
modules/request.t                  10    8  80.00%  3-10
modules/status.t      111 28416    10   10 100.00%  1-10
modules/symbol.t                   ??   ??       %  ??
modules/uri.t                      ??   ??       %  ??
modules/util.t                     ??   ??       %  ??
6 tests skipped.
kill: (20226) - No such pid
httpd terminated
Failed 18/38 test scripts, 52.63% okay. 71/267 subtests failed, 73.41% okay.
make: *** [run_tests] Error 2

Mime
View raw message