htrace-dev mailing list archives

Site index · List index
Message view « Date » · « Thread »
Top « Date » · « Thread »
From Apache Jenkins Server <jenk...@builds.apache.org>
Subject Build failed in Jenkins: HTrace-Master #105
Date Wed, 16 Sep 2015 21:32:23 GMT
See <https://builds.apache.org/job/HTrace-Master/105/>

------------------------------------------
[...truncated 46847 lines...]
[DEBUG]  - included src/test/java/org/apache/htrace/impl/TestHTracedRESTReceiver.java
[DEBUG]  - included pom.xml
Warning:  org.apache.xerces.jaxp.SAXParserImpl$JAXPSAXParser: Property 'http://www.oracle.com/xml/jaxp/properties/entityExpansionLimit'
is not recognized.
Compiler warnings:
  WARNING:  'org.apache.xerces.jaxp.SAXParserImpl: Property 'http://javax.xml.XMLConstants/property/accessExternalDTD'
is not recognized.'
Warning:  org.apache.xerces.parsers.SAXParser: Feature 'http://javax.xml.XMLConstants/feature/secure-processing'
is not recognized.
Warning:  org.apache.xerces.parsers.SAXParser: Property 'http://javax.xml.XMLConstants/property/accessExternalDTD'
is not recognized.
Warning:  org.apache.xerces.parsers.SAXParser: Property 'http://www.oracle.com/xml/jaxp/properties/entityExpansionLimit'
is not recognized.
[INFO] Rat check: Summary of files. Unapproved: 0 unknown: 0 generated: 0 approved: 62 licence.
[INFO] 
[INFO] --- maven-site-plugin:3.4:attach-descriptor (attach-descriptor) @ htrace-htraced ---
[DEBUG] Configuring mojo org.apache.maven.plugins:maven-site-plugin:3.4:attach-descriptor
from plugin realm ClassRealm[plugin>org.apache.maven.plugins:maven-site-plugin:3.4, parent:
sun.misc.Launcher$AppClassLoader@207148e9]
[DEBUG] Configuring mojo 'org.apache.maven.plugins:maven-site-plugin:3.4:attach-descriptor'
with basic configurator -->
[DEBUG]   (f) basedir = /htrace/htrace-htraced
[DEBUG]   (f) inputEncoding = UTF-8
[DEBUG]   (f) localRepository =        id: local
      url: file:///root/.m2/repository/
   layout: none

[DEBUG]   (f) outputEncoding = UTF-8
[DEBUG]   (f) pomPackagingOnly = true
[DEBUG]   (f) project = MavenProject: org.apache.htrace:htrace-htraced:4.1.0-incubating-SNAPSHOT
@ /htrace/htrace-htraced/pom.xml
[DEBUG]   (f) reactorProjects = [MavenProject: org.apache.htrace:htrace:4.1.0-incubating-SNAPSHOT
@ /htrace/pom.xml, MavenProject: org.apache.htrace:htrace-c:4.1.0-incubating-SNAPSHOT @ /htrace/htrace-c/pom.xml,
MavenProject: org.apache.htrace:htrace-core:4.1.0-incubating-SNAPSHOT @ /htrace/htrace-core/dependency-reduced-pom.xml,
MavenProject: org.apache.htrace:htrace-webapp:4.1.0-incubating-SNAPSHOT @ /htrace/htrace-webapp/pom.xml,
MavenProject: org.apache.htrace:htrace-zipkin:4.1.0-incubating-SNAPSHOT @ /htrace/htrace-zipkin/dependency-reduced-pom.xml,
MavenProject: org.apache.htrace:htrace-hbase:4.1.0-incubating-SNAPSHOT @ /htrace/htrace-hbase/dependency-reduced-pom.xml,
MavenProject: org.apache.htrace:htrace-flume:4.1.0-incubating-SNAPSHOT @ /htrace/htrace-flume/pom.xml,
MavenProject: org.apache.htrace:htrace-htraced:4.1.0-incubating-SNAPSHOT @ /htrace/htrace-htraced/pom.xml]
[DEBUG]   (f) siteDirectory = /htrace/htrace-htraced/src/main/site
[DEBUG] -- end configuration --
[INFO] 
[INFO] --- maven-shade-plugin:2.1:shade (default) @ htrace-htraced ---
[DEBUG] Configuring mojo org.apache.maven.plugins:maven-shade-plugin:2.1:shade from plugin
realm ClassRealm[plugin>org.apache.maven.plugins:maven-shade-plugin:2.1, parent: sun.misc.Launcher$AppClassLoader@207148e9]
[DEBUG] Configuring mojo 'org.apache.maven.plugins:maven-shade-plugin:2.1:shade' with basic
configurator -->
[DEBUG]   (f) createDependencyReducedPom = true
[DEBUG]   (f) dependencyReducedPomLocation = /htrace/htrace-htraced/dependency-reduced-pom.xml
[DEBUG]   (f) generateUniqueDependencyReducedPom = false
[DEBUG]   (f) localRepository =        id: local
      url: file:///root/.m2/repository/
   layout: none

[DEBUG]   (f) outputDirectory = /htrace/htrace-htraced/target
[DEBUG]   (f) pattern = org.apache.commons.logging
[DEBUG]   (f) shadedPattern = org.apache.htrace.commons.logging
[DEBUG]   (f) pattern = com.fasterxml.jackson
[DEBUG]   (f) shadedPattern = org.apache.htrace.fasterxml.jackson
[DEBUG]   (f) pattern = org.eclipse.jetty
[DEBUG]   (f) shadedPattern = org.apache.htrace.jetty
[DEBUG]   (f) relocations = [org.apache.maven.plugins.shade.mojo.PackageRelocation@3678857e,
org.apache.maven.plugins.shade.mojo.PackageRelocation@22842f22, org.apache.maven.plugins.shade.mojo.PackageRelocation@143272e2]
[DEBUG]   (f) remoteArtifactRepositories = [       id: apache.snapshots
      url: http://repository.apache.org/snapshots
   layout: default
snapshots: [enabled => true, update => daily]
 releases: [enabled => false, update => daily]
,        id: central
      url: http://repo.maven.apache.org/maven2
   layout: default
snapshots: [enabled => false, update => daily]
 releases: [enabled => true, update => daily]
]
[DEBUG]   (f) shadeSourcesContent = false
[DEBUG]   (f) shadedArtifactId = htrace-htraced
[DEBUG]   (f) shadedClassifierName = shaded
[DEBUG]   (f) useBaseVersion = false
[DEBUG]   (f) project = MavenProject: org.apache.htrace:htrace-htraced:4.1.0-incubating-SNAPSHOT
@ /htrace/htrace-htraced/pom.xml
[DEBUG]   (f) session = org.apache.maven.execution.MavenSession@7aac7212
[DEBUG] -- end configuration --
[INFO] Including com.fasterxml.jackson.core:jackson-core:jar:2.4.0 in the shaded jar.
[INFO] Including com.fasterxml.jackson.core:jackson-databind:jar:2.4.0 in the shaded jar.
[INFO] Including com.fasterxml.jackson.core:jackson-annotations:jar:2.4.0 in the shaded jar.
[INFO] Including org.eclipse.jetty:jetty-client:jar:9.2.6.v20141205 in the shaded jar.
[INFO] Including org.eclipse.jetty:jetty-http:jar:9.2.6.v20141205 in the shaded jar.
[INFO] Including org.eclipse.jetty:jetty-util:jar:9.2.6.v20141205 in the shaded jar.
[INFO] Including org.eclipse.jetty:jetty-io:jar:9.2.6.v20141205 in the shaded jar.
[DEBUG] Processing JAR /htrace/htrace-htraced/target/htrace-htraced-4.1.0-incubating-SNAPSHOT.jar
[DEBUG] Processing JAR /root/.m2/repository/com/fasterxml/jackson/core/jackson-core/2.4.0/jackson-core-2.4.0.jar
[DEBUG] Processing JAR /root/.m2/repository/com/fasterxml/jackson/core/jackson-databind/2.4.0/jackson-databind-2.4.0.jar
[DEBUG] Processing JAR /root/.m2/repository/com/fasterxml/jackson/core/jackson-annotations/2.4.0/jackson-annotations-2.4.0.jar
[DEBUG] Processing JAR /root/.m2/repository/org/eclipse/jetty/jetty-client/9.2.6.v20141205/jetty-client-9.2.6.v20141205.jar
[DEBUG] Processing JAR /root/.m2/repository/org/eclipse/jetty/jetty-http/9.2.6.v20141205/jetty-http-9.2.6.v20141205.jar
[DEBUG] Processing JAR /root/.m2/repository/org/eclipse/jetty/jetty-util/9.2.6.v20141205/jetty-util-9.2.6.v20141205.jar
[DEBUG] Processing JAR /root/.m2/repository/org/eclipse/jetty/jetty-io/9.2.6.v20141205/jetty-io-9.2.6.v20141205.jar
[INFO] Replacing original artifact with shaded artifact.
[INFO] Replacing /htrace/htrace-htraced/target/htrace-htraced-4.1.0-incubating-SNAPSHOT.jar
with /htrace/htrace-htraced/target/htrace-htraced-4.1.0-incubating-SNAPSHOT-shaded.jar
[INFO] Dependency-reduced POM written at: /htrace/htrace-htraced/dependency-reduced-pom.xml
[DEBUG] Extension realms for project org.apache.htrace:htrace-htraced:jar:4.1.0-incubating-SNAPSHOT:
(none)
[DEBUG] Looking up lifecyle mappings for packaging jar from ClassRealm[plexus.core, parent:
null]
[DEBUG] building maven3 dependency graph for org.apache.htrace:htrace-htraced:jar:4.1.0-incubating-SNAPSHOT
[DEBUG] org.apache.htrace:htrace-htraced:jar:4.1.0-incubating-SNAPSHOT
[DEBUG]    org.apache.htrace:htrace-core:jar:4.1.0-incubating-SNAPSHOT:provided
[DEBUG]    org.apache.htrace:htrace-core:jar:tests:4.1.0-incubating-SNAPSHOT:test
[DEBUG]    org.apache.htrace:htrace-webapp:war:4.1.0-incubating-SNAPSHOT:provided
[DEBUG]    commons-logging:commons-logging:jar:1.1.1:provided
[DEBUG]    junit:junit:jar:4.11:test
[DEBUG]       org.hamcrest:hamcrest-core:jar:1.3:test
[INFO] Dependency-reduced POM written at: /htrace/htrace-htraced/dependency-reduced-pom.xml
[DEBUG] Extension realms for project org.apache.htrace:htrace-htraced:jar:4.1.0-incubating-SNAPSHOT:
(none)
[DEBUG] Looking up lifecyle mappings for packaging jar from ClassRealm[plexus.core, parent:
null]
[DEBUG] building maven3 dependency graph for org.apache.htrace:htrace-htraced:jar:4.1.0-incubating-SNAPSHOT
[DEBUG] org.apache.htrace:htrace-htraced:jar:4.1.0-incubating-SNAPSHOT
[DEBUG]    org.apache.htrace:htrace-core:jar:4.1.0-incubating-SNAPSHOT:provided
[DEBUG]    org.apache.htrace:htrace-core:jar:tests:4.1.0-incubating-SNAPSHOT:test
[DEBUG]    org.apache.htrace:htrace-webapp:war:4.1.0-incubating-SNAPSHOT:provided
[DEBUG]    commons-logging:commons-logging:jar:1.1.1:provided
[DEBUG]    junit:junit:jar:4.11:test
[INFO] 
[INFO] --- maven-jar-plugin:2.4:test-jar (default) @ htrace-htraced ---
[DEBUG] Configuring mojo org.apache.maven.plugins:maven-jar-plugin:2.4:test-jar from plugin
realm ClassRealm[plugin>org.apache.maven.plugins:maven-jar-plugin:2.4, parent: sun.misc.Launcher$AppClassLoader@207148e9]
[DEBUG] Configuring mojo 'org.apache.maven.plugins:maven-jar-plugin:2.4:test-jar' with basic
configurator -->
[DEBUG]   (s) addDefaultSpecificationEntries = true
[DEBUG]   (s) addDefaultImplementationEntries = true
[DEBUG]   (s) manifest = org.apache.maven.archiver.ManifestConfiguration@6afe181b
[DEBUG]   (f) archive = org.apache.maven.archiver.MavenArchiveConfiguration@4fe0cb7d
[DEBUG]   (f) defaultManifestFile = /htrace/htrace-htraced/target/classes/META-INF/MANIFEST.MF
[DEBUG]   (f) finalName = htrace-htraced-4.1.0-incubating-SNAPSHOT
[DEBUG]   (f) forceCreation = false
[DEBUG]   (f) outputDirectory = /htrace/htrace-htraced/target
[DEBUG]   (f) project = MavenProject: org.apache.htrace:htrace-htraced:4.1.0-incubating-SNAPSHOT
@ /htrace/htrace-htraced/dependency-reduced-pom.xml
[DEBUG]   (f) session = org.apache.maven.execution.MavenSession@7aac7212
[DEBUG]   (f) skipIfEmpty = false
[DEBUG]   (f) testClassesDirectory = /htrace/htrace-htraced/target/test-classes
[DEBUG]   (f) useDefaultManifestFile = false
[DEBUG] -- end configuration --
[DEBUG] isUp2date: false (Destination /htrace/htrace-htraced/target/htrace-htraced-4.1.0-incubating-SNAPSHOT-tests.jar
not found.)
[INFO] Building jar: /htrace/htrace-htraced/target/htrace-htraced-4.1.0-incubating-SNAPSHOT-tests.jar
[DEBUG] adding directory META-INF/
[DEBUG] adding entry META-INF/MANIFEST.MF
[DEBUG] adding directory org/
[DEBUG] adding directory org/apache/
[DEBUG] adding directory org/apache/htrace/
[DEBUG] adding directory org/apache/htrace/util/
[DEBUG] adding directory org/apache/htrace/impl/
[DEBUG] adding entry META-INF/LICENSE
[DEBUG] adding entry META-INF/DEPENDENCIES
[DEBUG] adding entry META-INF/NOTICE
[DEBUG] adding entry org/apache/htrace/util/DataDir.class
[DEBUG] adding entry org/apache/htrace/util/HTracedProcess$StartupNotificationData.class
[DEBUG] adding entry org/apache/htrace/util/TestHTracedProcess.class
[DEBUG] adding entry org/apache/htrace/util/HTracedProcess.class
[DEBUG] adding entry org/apache/htrace/impl/TestHTracedRESTReceiver.class
[DEBUG] adding entry org/apache/htrace/impl/TestHTracedRESTReceiver$TestHTraceConfiguration.class
[DEBUG] adding entry org/apache/htrace/impl/TestHTracedRESTReceiver$1.class
[DEBUG] adding directory META-INF/maven/
[DEBUG] adding directory META-INF/maven/org.apache.htrace/
[DEBUG] adding directory META-INF/maven/org.apache.htrace/htrace-htraced/
[DEBUG] adding entry META-INF/maven/org.apache.htrace/htrace-htraced/pom.xml
[DEBUG] adding entry META-INF/maven/org.apache.htrace/htrace-htraced/pom.properties
[INFO] 
[INFO] --- maven-install-plugin:2.3.1:install (default-install) @ htrace-htraced ---
[DEBUG] Configuring mojo org.apache.maven.plugins:maven-install-plugin:2.3.1:install from
plugin realm ClassRealm[plugin>org.apache.maven.plugins:maven-install-plugin:2.3.1, parent:
sun.misc.Launcher$AppClassLoader@207148e9]
[DEBUG] Configuring mojo 'org.apache.maven.plugins:maven-install-plugin:2.3.1:install' with
basic configurator -->
[DEBUG]   (f) artifact = org.apache.htrace:htrace-htraced:jar:4.1.0-incubating-SNAPSHOT
[DEBUG]   (f) attachedArtifacts = [org.apache.htrace:htrace-htraced:java-source:sources:4.1.0-incubating-SNAPSHOT,
org.apache.htrace:htrace-htraced:javadoc:javadoc:4.1.0-incubating-SNAPSHOT, org.apache.htrace:htrace-htraced:test-jar:tests:4.1.0-incubating-SNAPSHOT]
[DEBUG]   (f) createChecksum = false
[DEBUG]   (f) localRepository =        id: local
      url: file:///root/.m2/repository/
   layout: none

[DEBUG]   (f) packaging = jar
[DEBUG]   (f) pomFile = /htrace/htrace-htraced/dependency-reduced-pom.xml
[DEBUG]   (f) updateReleaseInfo = false
[DEBUG] -- end configuration --
[INFO] Installing /htrace/htrace-htraced/target/htrace-htraced-4.1.0-incubating-SNAPSHOT.jar
to /root/.m2/repository/org/apache/htrace/htrace-htraced/4.1.0-incubating-SNAPSHOT/htrace-htraced-4.1.0-incubating-SNAPSHOT.jar
[DEBUG] Writing resolution tracking file /root/.m2/repository/org/apache/htrace/htrace-htraced/4.1.0-incubating-SNAPSHOT/_maven.repositories
[INFO] Installing /htrace/htrace-htraced/dependency-reduced-pom.xml to /root/.m2/repository/org/apache/htrace/htrace-htraced/4.1.0-incubating-SNAPSHOT/htrace-htraced-4.1.0-incubating-SNAPSHOT.pom
[DEBUG] Writing resolution tracking file /root/.m2/repository/org/apache/htrace/htrace-htraced/4.1.0-incubating-SNAPSHOT/_maven.repositories
[DEBUG] Installing org.apache.htrace:htrace-htraced:4.1.0-incubating-SNAPSHOT/maven-metadata.xml
to /root/.m2/repository/org/apache/htrace/htrace-htraced/4.1.0-incubating-SNAPSHOT/maven-metadata-local.xml
[DEBUG] Installing org.apache.htrace:htrace-htraced/maven-metadata.xml to /root/.m2/repository/org/apache/htrace/htrace-htraced/maven-metadata-local.xml
[INFO] Installing /htrace/htrace-htraced/target/htrace-htraced-4.1.0-incubating-SNAPSHOT-sources.jar
to /root/.m2/repository/org/apache/htrace/htrace-htraced/4.1.0-incubating-SNAPSHOT/htrace-htraced-4.1.0-incubating-SNAPSHOT-sources.jar
[DEBUG] Writing resolution tracking file /root/.m2/repository/org/apache/htrace/htrace-htraced/4.1.0-incubating-SNAPSHOT/_maven.repositories
[DEBUG] Installing org.apache.htrace:htrace-htraced:4.1.0-incubating-SNAPSHOT/maven-metadata.xml
to /root/.m2/repository/org/apache/htrace/htrace-htraced/4.1.0-incubating-SNAPSHOT/maven-metadata-local.xml
[DEBUG] Installing org.apache.htrace:htrace-htraced/maven-metadata.xml to /root/.m2/repository/org/apache/htrace/htrace-htraced/maven-metadata-local.xml
[INFO] Installing /htrace/htrace-htraced/target/htrace-htraced-4.1.0-incubating-SNAPSHOT-javadoc.jar
to /root/.m2/repository/org/apache/htrace/htrace-htraced/4.1.0-incubating-SNAPSHOT/htrace-htraced-4.1.0-incubating-SNAPSHOT-javadoc.jar
[DEBUG] Writing resolution tracking file /root/.m2/repository/org/apache/htrace/htrace-htraced/4.1.0-incubating-SNAPSHOT/_maven.repositories
[DEBUG] Installing org.apache.htrace:htrace-htraced:4.1.0-incubating-SNAPSHOT/maven-metadata.xml
to /root/.m2/repository/org/apache/htrace/htrace-htraced/4.1.0-incubating-SNAPSHOT/maven-metadata-local.xml
[DEBUG] Installing org.apache.htrace:htrace-htraced/maven-metadata.xml to /root/.m2/repository/org/apache/htrace/htrace-htraced/maven-metadata-local.xml
[INFO] Installing /htrace/htrace-htraced/target/htrace-htraced-4.1.0-incubating-SNAPSHOT-tests.jar
to /root/.m2/repository/org/apache/htrace/htrace-htraced/4.1.0-incubating-SNAPSHOT/htrace-htraced-4.1.0-incubating-SNAPSHOT-tests.jar
[DEBUG] Writing resolution tracking file /root/.m2/repository/org/apache/htrace/htrace-htraced/4.1.0-incubating-SNAPSHOT/_maven.repositories
[DEBUG] Installing org.apache.htrace:htrace-htraced:4.1.0-incubating-SNAPSHOT/maven-metadata.xml
to /root/.m2/repository/org/apache/htrace/htrace-htraced/4.1.0-incubating-SNAPSHOT/maven-metadata-local.xml
[DEBUG] Installing org.apache.htrace:htrace-htraced/maven-metadata.xml to /root/.m2/repository/org/apache/htrace/htrace-htraced/maven-metadata-local.xml
[INFO] ------------------------------------------------------------------------
[INFO] Reactor Summary:
[INFO] 
[INFO] Apache HTrace ..................................... SUCCESS [21.546s]
[INFO] htrace-c .......................................... SUCCESS [3.793s]
[INFO] htrace-core ....................................... SUCCESS [25.305s]
[INFO] htrace-webapp ..................................... SUCCESS [3.384s]
[INFO] htrace-zipkin ..................................... SUCCESS [19.265s]
[INFO] htrace-hbase ...................................... SUCCESS [41.112s]
[INFO] htrace-flume ...................................... SUCCESS [16.639s]
[INFO] htrace-htraced .................................... SUCCESS [38.813s]
[INFO] ------------------------------------------------------------------------
[INFO] BUILD SUCCESS
[INFO] ------------------------------------------------------------------------
[INFO] Total time: 2:50.268s
[INFO] Finished at: Wed Sep 16 21:32:29 UTC 2015
[INFO] Final Memory: 55M/927M
[INFO] ------------------------------------------------------------------------
[HTrace-Master] $ /home/jenkins/jenkins-slave/tools/hudson.tasks.Maven_MavenInstallation/Maven_3.0.3/bin/mvn
-Dmaven.test.redirectTestOutputToFile=true install
[INFO] Scanning for projects...
[INFO] ------------------------------------------------------------------------
[INFO] Reactor Build Order:
[INFO] 
[INFO] Apache HTrace
[INFO] htrace-c
[INFO] htrace-core
[INFO] htrace-webapp
[INFO] htrace-zipkin
[INFO] htrace-hbase
[INFO] htrace-flume
[INFO] htrace-htraced
[INFO]                                                                         
[INFO] ------------------------------------------------------------------------
[INFO] Building Apache HTrace 4.1.0-incubating-SNAPSHOT
[INFO] ------------------------------------------------------------------------
[INFO] 
[INFO] --- maven-remote-resources-plugin:1.4:process (default) @ htrace ---
[INFO] ------------------------------------------------------------------------
[INFO] Reactor Summary:
[INFO] 
[INFO] Apache HTrace ..................................... FAILURE [1.023s]
[INFO] htrace-c .......................................... SKIPPED
[INFO] htrace-core ....................................... SKIPPED
[INFO] htrace-webapp ..................................... SKIPPED
[INFO] htrace-zipkin ..................................... SKIPPED
[INFO] htrace-hbase ...................................... SKIPPED
[INFO] htrace-flume ...................................... SKIPPED
[INFO] htrace-htraced .................................... SKIPPED
[INFO] ------------------------------------------------------------------------
[INFO] BUILD FAILURE
[INFO] ------------------------------------------------------------------------
[INFO] Total time: 1.412s
[INFO] Finished at: Wed Sep 16 21:32:33 UTC 2015
[INFO] Final Memory: 18M/723M
[INFO] ------------------------------------------------------------------------
[ERROR] Failed to execute goal org.apache.maven.plugins:maven-remote-resources-plugin:1.4:process
(default) on project htrace: Error finding remote resources manifests: <https://builds.apache.org/job/HTrace-Master/ws/target/maven-shared-archive-resources/META-INF/NOTICE>
(Permission denied) -> [Help 1]
[ERROR] 
[ERROR] To see the full stack trace of the errors, re-run Maven with the -e switch.
[ERROR] Re-run Maven using the -X switch to enable full debug logging.
[ERROR] 
[ERROR] For more information about the errors and possible solutions, please read the following
articles:
[ERROR] [Help 1] http://cwiki.apache.org/confluence/display/MAVEN/MojoExecutionException
Build step 'Invoke top-level Maven targets' marked build as failure
[FINDBUGS] Skipping publisher since build result is FAILURE
Performing Post build task...
Match found for :.* : True
Logical operation result is TRUE
Running script  : 
[HTrace-Master] $ /bin/bash -xe /tmp/hudson3968893551991706256.sh
POST BUILD TASK : SUCCESS
END OF POST BUILD TASK : 0
Archiving artifacts
No prior successful build to compare, so performing full copy of artifacts
Recording test results

Mime
View raw message