htrace-dev mailing list archives

Site index · List index
Message view « Date » · « Thread »
Top « Date » · « Thread »
From Apache Jenkins Server <jenk...@builds.apache.org>
Subject Build failed in Jenkins: HTrace-Master #76
Date Wed, 09 Sep 2015 19:47:55 GMT
See <https://builds.apache.org/job/HTrace-Master/76/changes>

Changes:

[cmccabe] HTRACE-239. Add htrace/impl/TestZipkinSpanReceiver.java (Adrian Cole via Colin P.
McCabe)

------------------------------------------
[...truncated 5285 lines...]
34 KB   48 KB   41 KB   14 KB   
34 KB   48 KB   41 KB   14 KB   
34 KB   48 KB   43 KB   14 KB   
34 KB   52 KB   43 KB   14 KB   
34 KB   56 KB   43 KB   14 KB   
34 KB   60 KB   43 KB   14 KB   
34 KB   64 KB   43 KB   14 KB   
34 KB   68 KB   43 KB   14 KB   
34 KB   72 KB   43 KB   14 KB   
34 KB   74 KB   43 KB   14 KB   
34 KB   74 KB   43 KB   18 KB   
34 KB   74 KB   43 KB   22 KB   
34 KB   74 KB   43 KB   26 KB   
34 KB   74 KB   43 KB   30 KB   
34 KB   74 KB   43 KB   31 KB   
38 KB   74 KB   43 KB   31 KB   
42 KB   74 KB   43 KB   31 KB   
45 KB   74 KB   43 KB   31 KB   
49 KB   74 KB   43 KB   31 KB   
53 KB   74 KB   43 KB   31 KB   
57 KB   74 KB   43 KB   31 KB   
61 KB   74 KB   43 KB   31 KB   
61 KB   74 KB   47 KB   31 KB   
61 KB   74 KB   51 KB   31 KB   
61 KB   74 KB   55 KB   31 KB   
61 KB   74 KB   59 KB   31 KB   
61 KB   78 KB   63 KB   31 KB   
61 KB   78 KB   63 KB   31 KB   
61 KB   78 KB   67 KB   31 KB   
61 KB   82 KB   67 KB   31 KB   
61 KB   82 KB   71 KB   31 KB   
61 KB   86 KB   71 KB   31 KB   
61 KB   86 KB   75 KB   31 KB   
61 KB   86 KB   76 KB   31 KB   
61 KB   90 KB   76 KB   31 KB   
61 KB   94 KB   76 KB   31 KB   
61 KB   98 KB   76 KB   31 KB   
61 KB   98 KB   79 KB   31 KB   
61 KB   102 KB   79 KB   31 KB   
61 KB   106 KB   79 KB   31 KB   
61 KB   106 KB   83 KB   31 KB   
61 KB   109 KB   83 KB   31 KB   
61 KB   109 KB   87 KB   31 KB   
61 KB   109 KB   91 KB   31 KB   
61 KB   109 KB   95 KB   31 KB   
61 KB   109 KB   99 KB   31 KB   
61 KB   109 KB   99 KB   35 KB   
61 KB   109 KB   99 KB   39 KB   
61 KB   109 KB   99 KB   43 KB   
61 KB   109 KB   99 KB   47 KB   
61 KB   109 KB   99 KB   51 KB   
65 KB   109 KB   99 KB   51 KB   
69 KB   109 KB   99 KB   51 KB   
69 KB   109 KB   99 KB   51 KB   
73 KB   109 KB   99 KB   51 KB   
77 KB   109 KB   99 KB   51 KB   
78 KB   109 KB   99 KB   51 KB   
82 KB   109 KB   99 KB   51 KB   
82 KB   109 KB   99 KB   51 KB   
85 KB   109 KB   99 KB   51 KB   
89 KB   109 KB   99 KB   51 KB   
93 KB   109 KB   99 KB   51 KB   
93 KB   109 KB   99 KB   51 KB   
93 KB   109 KB   103 KB   51 KB   
93 KB   109 KB   103 KB   51 KB   
93 KB   113 KB   103 KB   51 KB   
93 KB   117 KB   103 KB   51 KB   
93 KB   121 KB   103 KB   51 KB   
93 KB   125 KB   103 KB   51 KB   
93 KB   129 KB   103 KB   51 KB   
93 KB   133 KB   103 KB   51 KB   
93 KB   137 KB   103 KB   51 KB   
93 KB   141 KB   103 KB   51 KB   
93 KB   145 KB   103 KB   51 KB   
93 KB   149 KB   103 KB   51 KB   
93 KB   151 KB   103 KB   51 KB   
93 KB   151 KB   103 KB   55 KB   
93 KB   151 KB   103 KB   59 KB   
93 KB   151 KB   103 KB   63 KB   
93 KB   151 KB   103 KB   67 KB   
93 KB   151 KB   103 KB   71 KB   
93 KB   151 KB   103 KB   75 KB   
93 KB   151 KB   103 KB   75 KB   
97 KB   151 KB   103 KB   75 KB   
101 KB   151 KB   103 KB   75 KB   
105 KB   151 KB   103 KB   75 KB   
109 KB   151 KB   103 KB   75 KB   
113 KB   151 KB   103 KB   75 KB   
116 KB   151 KB   103 KB   75 KB   
120 KB   151 KB   103 KB   75 KB   
122 KB   151 KB   103 KB   75 KB   
126 KB   151 KB   103 KB   75 KB   
126 KB   151 KB   103 KB   75 KB   
130 KB   151 KB   103 KB   75 KB   
134 KB   151 KB   103 KB   75 KB   
137 KB   151 KB   103 KB   75 KB   
137 KB   155 KB   103 KB   75 KB   
137 KB   159 KB   103 KB   75 KB   
137 KB   163 KB   103 KB   75 KB   
137 KB   167 KB   103 KB   75 KB   
137 KB   171 KB   103 KB   75 KB   
137 KB   175 KB   103 KB   75 KB   
137 KB   179 KB   103 KB   75 KB   
137 KB   183 KB   103 KB   75 KB   
137 KB   187 KB   103 KB   75 KB   
137 KB   191 KB   103 KB   75 KB   
137 KB   195 KB   103 KB   75 KB   
137 KB   199 KB   103 KB   75 KB   
137 KB   202 KB   103 KB   75 KB   
                                   
Downloaded: http://repo1.maven.org/maven2/org/eclipse/jetty/jetty-io/9.2.6.v20141205/jetty-io-9.2.6.v20141205.jar
(103 KB at 480.0 KB/sec)
137 KB   202 KB   79 KB            
137 KB   202 KB   83 KB   
137 KB   202 KB   87 KB   
137 KB   202 KB   91 KB   
137 KB   202 KB   95 KB   
137 KB   202 KB   99 KB   
137 KB   202 KB   103 KB   
137 KB   202 KB   103 KB   
141 KB   202 KB   103 KB   
145 KB   202 KB   103 KB   
146 KB   202 KB   103 KB   
150 KB   202 KB   103 KB   
150 KB   202 KB   103 KB   
151 KB   202 KB   103 KB   
155 KB   202 KB   103 KB   
158 KB   202 KB   103 KB   
162 KB   202 KB   103 KB   
166 KB   202 KB   103 KB   
170 KB   202 KB   103 KB   
174 KB   202 KB   103 KB   
178 KB   202 KB   103 KB   
182 KB   202 KB   103 KB   
186 KB   202 KB   103 KB   
190 KB   202 KB   103 KB   
192 KB   202 KB   103 KB   
192 KB   206 KB   103 KB   
192 KB   210 KB   103 KB   
192 KB   214 KB   103 KB   
192 KB   218 KB   103 KB   
192 KB   222 KB   103 KB   
192 KB   223 KB   103 KB   
                           
Downloaded: http://repo1.maven.org/maven2/org/eclipse/jetty/jetty-http/9.2.6.v20141205/jetty-http-9.2.6.v20141205.jar
(103 KB at 401.7 KB/sec)
196 KB   223 KB            
200 KB   223 KB   
204 KB   223 KB   
208 KB   223 KB   
209 KB   223 KB   
213 KB   223 KB   
217 KB   223 KB   
221 KB   223 KB   
225 KB   223 KB   
229 KB   223 KB   
233 KB   223 KB   
237 KB   223 KB   
241 KB   223 KB   
242 KB   223 KB   
246 KB   223 KB   
250 KB   223 KB   
254 KB   223 KB   
257 KB   223 KB   
                  
Downloaded: http://repo1.maven.org/maven2/org/eclipse/jetty/jetty-client/9.2.6.v20141205/jetty-client-9.2.6.v20141205.jar
(223 KB at 787.1 KB/sec)
261 KB            
265 KB   
269 KB   
272 KB   
276 KB   
279 KB   
283 KB   
287 KB   
291 KB   
295 KB   
299 KB   
303 KB   
307 KB   
311 KB   
315 KB   
317 KB   
321 KB   
322 KB   
326 KB   
330 KB   
334 KB   
335 KB   
338 KB   
342 KB   
342 KB   
         
Downloaded: http://repo1.maven.org/maven2/org/eclipse/jetty/jetty-util/9.2.6.v20141205/jetty-util-9.2.6.v20141205.jar
(342 KB at 902.0 KB/sec)
[INFO] 
[INFO] --- maven-remote-resources-plugin:1.4:process (default) @ htrace-htraced ---
[INFO] 
[INFO] --- maven-resources-plugin:2.6:resources (default-resources) @ htrace-htraced ---
[INFO] Using 'UTF-8' encoding to copy filtered resources.
[INFO] skip non existing resourceDirectory <https://builds.apache.org/job/HTrace-Master/ws/htrace-htraced/src/main/resources>
[INFO] Copying 3 resources
[INFO] 
[INFO] --- maven-compiler-plugin:2.5.1:compile (default-compile) @ htrace-htraced ---
[INFO] Compiling 1 source file to <https://builds.apache.org/job/HTrace-Master/ws/htrace-htraced/target/classes>
[INFO] 
[INFO] --- maven-antrun-plugin:1.6:run (go_compile) @ htrace-htraced ---
[WARNING] Parameter tasks is deprecated, use target instead
[INFO] Executing tasks

main:
     [exec] You must install the leveldb-devel package (or distro-specific equivalent.)
[INFO] ------------------------------------------------------------------------
[INFO] Reactor Summary:
[INFO] 
[INFO] Apache HTrace ..................................... SUCCESS [3.389s]
[INFO] htrace-c .......................................... SUCCESS [0.761s]
[INFO] htrace-core ....................................... SUCCESS [16.243s]
[INFO] htrace-webapp ..................................... SUCCESS [0.945s]
[INFO] htrace-zipkin ..................................... SUCCESS [18.305s]
[INFO] htrace-hbase ...................................... SUCCESS [32.874s]
[INFO] htrace-flume ...................................... SUCCESS [18.016s]
[INFO] htrace-htraced .................................... FAILURE [2.333s]
[INFO] ------------------------------------------------------------------------
[INFO] BUILD FAILURE
[INFO] ------------------------------------------------------------------------
[INFO] Total time: 1:33.276s
[INFO] Finished at: Wed Sep 09 19:47:56 UTC 2015
[INFO] Final Memory: 60M/1235M
[INFO] ------------------------------------------------------------------------
[ERROR] Failed to execute goal org.apache.maven.plugins:maven-antrun-plugin:1.6:run (go_compile)
on project htrace-htraced: An Ant BuildException has occured: exec returned: 1 -> [Help
1]
[ERROR] 
[ERROR] To see the full stack trace of the errors, re-run Maven with the -e switch.
[ERROR] Re-run Maven using the -X switch to enable full debug logging.
[ERROR] 
[ERROR] For more information about the errors and possible solutions, please read the following
articles:
[ERROR] [Help 1] http://cwiki.apache.org/confluence/display/MAVEN/MojoExecutionException
[ERROR] 
[ERROR] After correcting the problems, you can resume the build with the command
[ERROR]   mvn <goals> -rf :htrace-htraced
Build step 'Invoke top-level Maven targets' marked build as failure
[FINDBUGS] Skipping publisher since build result is FAILURE
Performing Post build task...
Match found for :.* : True
Logical operation result is TRUE
Running script  : 
[HTrace-Master] $ /bin/bash -xe /tmp/hudson6933943120942219411.sh
POST BUILD TASK : SUCCESS
END OF POST BUILD TASK : 0
Archiving artifacts
No prior successful build to compare, so performing full copy of artifacts
Recording test results
Updating HTRACE-239

Mime
View raw message