htrace-dev mailing list archives

Site index · List index
Message view « Date » · « Thread »
Top « Date » · « Thread »
From Apache Jenkins Server <jenk...@builds.apache.org>
Subject Build failed in Jenkins: HTrace-Master #75
Date Wed, 09 Sep 2015 01:52:58 GMT
See <https://builds.apache.org/job/HTrace-Master/75/changes>

Changes:

[cmccabe] HTRACE-243. Remove duplicate maven-assembly-plugin configuration section in htrace-htraced/pom.xml
(Lewis John McGibbney via Colin P. McCabe)

------------------------------------------
[...truncated 714 lines...]
Building tree for all the packages and classes...
Generating <https://builds.apache.org/job/HTrace-Master/ws/htrace-hbase/target/apidocs/org/apache/htrace/HBaseHTraceConfiguration.html...>
Generating <https://builds.apache.org/job/HTrace-Master/ws/htrace-hbase/target/apidocs/org/apache/htrace/impl/HBaseSpanReceiver.html...>
Generating <https://builds.apache.org/job/HTrace-Master/ws/htrace-hbase/target/apidocs/org/apache/htrace/protobuf/generated/SpanProtos.html...>
Generating <https://builds.apache.org/job/HTrace-Master/ws/htrace-hbase/target/apidocs/org/apache/htrace/protobuf/generated/SpanProtos.Span.html...>
Generating <https://builds.apache.org/job/HTrace-Master/ws/htrace-hbase/target/apidocs/org/apache/htrace/protobuf/generated/SpanProtos.Span.Builder.html...>
Generating <https://builds.apache.org/job/HTrace-Master/ws/htrace-hbase/target/apidocs/org/apache/htrace/protobuf/generated/SpanProtos.SpanOrBuilder.html...>
Generating <https://builds.apache.org/job/HTrace-Master/ws/htrace-hbase/target/apidocs/org/apache/htrace/protobuf/generated/SpanProtos.TimelineAnnotation.html...>
Generating <https://builds.apache.org/job/HTrace-Master/ws/htrace-hbase/target/apidocs/org/apache/htrace/protobuf/generated/SpanProtos.TimelineAnnotation.Builder.html...>
Generating <https://builds.apache.org/job/HTrace-Master/ws/htrace-hbase/target/apidocs/org/apache/htrace/protobuf/generated/SpanProtos.TimelineAnnotationOrBuilder.html...>
Generating <https://builds.apache.org/job/HTrace-Master/ws/htrace-hbase/target/apidocs/org/apache/htrace/viewer/HBaseSpanViewer.html...>
Generating <https://builds.apache.org/job/HTrace-Master/ws/htrace-hbase/target/apidocs/org/apache/htrace/viewer/HBaseSpanViewerServer.html...>
Generating <https://builds.apache.org/job/HTrace-Master/ws/htrace-hbase/target/apidocs/org/apache/htrace/viewer/HBaseSpanViewerSpansServlet.html...>
Generating <https://builds.apache.org/job/HTrace-Master/ws/htrace-hbase/target/apidocs/org/apache/htrace/viewer/HBaseSpanViewerTracesServlet.html...>
Generating <https://builds.apache.org/job/HTrace-Master/ws/htrace-hbase/target/apidocs/overview-frame.html...>
Generating <https://builds.apache.org/job/HTrace-Master/ws/htrace-hbase/target/apidocs/org/apache/htrace/package-frame.html...>
Generating <https://builds.apache.org/job/HTrace-Master/ws/htrace-hbase/target/apidocs/org/apache/htrace/package-summary.html...>
Generating <https://builds.apache.org/job/HTrace-Master/ws/htrace-hbase/target/apidocs/org/apache/htrace/package-tree.html...>
Generating <https://builds.apache.org/job/HTrace-Master/ws/htrace-hbase/target/apidocs/org/apache/htrace/impl/package-frame.html...>
Generating <https://builds.apache.org/job/HTrace-Master/ws/htrace-hbase/target/apidocs/org/apache/htrace/impl/package-summary.html...>
Generating <https://builds.apache.org/job/HTrace-Master/ws/htrace-hbase/target/apidocs/org/apache/htrace/impl/package-tree.html...>
Generating <https://builds.apache.org/job/HTrace-Master/ws/htrace-hbase/target/apidocs/org/apache/htrace/protobuf/generated/package-frame.html...>
Generating <https://builds.apache.org/job/HTrace-Master/ws/htrace-hbase/target/apidocs/org/apache/htrace/protobuf/generated/package-summary.html...>
Generating <https://builds.apache.org/job/HTrace-Master/ws/htrace-hbase/target/apidocs/org/apache/htrace/protobuf/generated/package-tree.html...>
Generating <https://builds.apache.org/job/HTrace-Master/ws/htrace-hbase/target/apidocs/org/apache/htrace/viewer/package-frame.html...>
Generating <https://builds.apache.org/job/HTrace-Master/ws/htrace-hbase/target/apidocs/org/apache/htrace/viewer/package-summary.html...>
Generating <https://builds.apache.org/job/HTrace-Master/ws/htrace-hbase/target/apidocs/org/apache/htrace/viewer/package-tree.html...>
Generating <https://builds.apache.org/job/HTrace-Master/ws/htrace-hbase/target/apidocs/constant-values.html...>
Generating <https://builds.apache.org/job/HTrace-Master/ws/htrace-hbase/target/apidocs/serialized-form.html...>
Generating <https://builds.apache.org/job/HTrace-Master/ws/htrace-hbase/target/apidocs/org/apache/htrace/class-use/HBaseHTraceConfiguration.html...>
Generating <https://builds.apache.org/job/HTrace-Master/ws/htrace-hbase/target/apidocs/org/apache/htrace/impl/class-use/HBaseSpanReceiver.html...>
Generating <https://builds.apache.org/job/HTrace-Master/ws/htrace-hbase/target/apidocs/org/apache/htrace/protobuf/generated/class-use/SpanProtos.html...>
Generating <https://builds.apache.org/job/HTrace-Master/ws/htrace-hbase/target/apidocs/org/apache/htrace/protobuf/generated/class-use/SpanProtos.TimelineAnnotationOrBuilder.html...>
Generating <https://builds.apache.org/job/HTrace-Master/ws/htrace-hbase/target/apidocs/org/apache/htrace/protobuf/generated/class-use/SpanProtos.TimelineAnnotation.html...>
Generating <https://builds.apache.org/job/HTrace-Master/ws/htrace-hbase/target/apidocs/org/apache/htrace/protobuf/generated/class-use/SpanProtos.TimelineAnnotation.Builder.html...>
Generating <https://builds.apache.org/job/HTrace-Master/ws/htrace-hbase/target/apidocs/org/apache/htrace/protobuf/generated/class-use/SpanProtos.SpanOrBuilder.html...>
Generating <https://builds.apache.org/job/HTrace-Master/ws/htrace-hbase/target/apidocs/org/apache/htrace/protobuf/generated/class-use/SpanProtos.Span.html...>
Generating <https://builds.apache.org/job/HTrace-Master/ws/htrace-hbase/target/apidocs/org/apache/htrace/protobuf/generated/class-use/SpanProtos.Span.Builder.html...>
Generating <https://builds.apache.org/job/HTrace-Master/ws/htrace-hbase/target/apidocs/org/apache/htrace/viewer/class-use/HBaseSpanViewer.html...>
Generating <https://builds.apache.org/job/HTrace-Master/ws/htrace-hbase/target/apidocs/org/apache/htrace/viewer/class-use/HBaseSpanViewerTracesServlet.html...>
Generating <https://builds.apache.org/job/HTrace-Master/ws/htrace-hbase/target/apidocs/org/apache/htrace/viewer/class-use/HBaseSpanViewerSpansServlet.html...>
Generating <https://builds.apache.org/job/HTrace-Master/ws/htrace-hbase/target/apidocs/org/apache/htrace/viewer/class-use/HBaseSpanViewerServer.html...>
Generating <https://builds.apache.org/job/HTrace-Master/ws/htrace-hbase/target/apidocs/org/apache/htrace/package-use.html...>
Generating <https://builds.apache.org/job/HTrace-Master/ws/htrace-hbase/target/apidocs/org/apache/htrace/impl/package-use.html...>
Generating <https://builds.apache.org/job/HTrace-Master/ws/htrace-hbase/target/apidocs/org/apache/htrace/protobuf/generated/package-use.html...>
Generating <https://builds.apache.org/job/HTrace-Master/ws/htrace-hbase/target/apidocs/org/apache/htrace/viewer/package-use.html...>
Building index for all the packages and classes...
Generating <https://builds.apache.org/job/HTrace-Master/ws/htrace-hbase/target/apidocs/overview-tree.html...>
Generating <https://builds.apache.org/job/HTrace-Master/ws/htrace-hbase/target/apidocs/index-all.html...>
Generating <https://builds.apache.org/job/HTrace-Master/ws/htrace-hbase/target/apidocs/deprecated-list.html...>
Building index for all classes...
Generating <https://builds.apache.org/job/HTrace-Master/ws/htrace-hbase/target/apidocs/allclasses-frame.html...>
Generating <https://builds.apache.org/job/HTrace-Master/ws/htrace-hbase/target/apidocs/allclasses-noframe.html...>
Generating <https://builds.apache.org/job/HTrace-Master/ws/htrace-hbase/target/apidocs/index.html...>
Generating <https://builds.apache.org/job/HTrace-Master/ws/htrace-hbase/target/apidocs/overview-summary.html...>
Generating <https://builds.apache.org/job/HTrace-Master/ws/htrace-hbase/target/apidocs/help-doc.html...>
[INFO] Building jar: <https://builds.apache.org/job/HTrace-Master/ws/htrace-hbase/target/htrace-hbase-4.1.0-incubating-SNAPSHOT-javadoc.jar>
[INFO] 
[INFO] --- maven-site-plugin:3.4:attach-descriptor (attach-descriptor) @ htrace-hbase ---
[INFO] 
[INFO] --- maven-jar-plugin:2.4:test-jar (default) @ htrace-hbase ---
[INFO] Building jar: <https://builds.apache.org/job/HTrace-Master/ws/htrace-hbase/target/htrace-hbase-4.1.0-incubating-SNAPSHOT-tests.jar>
[INFO] 
[INFO] --- maven-install-plugin:2.3.1:install (default-install) @ htrace-hbase ---
[INFO] Installing <https://builds.apache.org/job/HTrace-Master/ws/htrace-hbase/target/htrace-hbase-4.1.0-incubating-SNAPSHOT.jar>
to /home/jenkins/.m2/repository/org/apache/htrace/htrace-hbase/4.1.0-incubating-SNAPSHOT/htrace-hbase-4.1.0-incubating-SNAPSHOT.jar
[INFO] Installing <https://builds.apache.org/job/HTrace-Master/ws/htrace-hbase/dependency-reduced-pom.xml>
to /home/jenkins/.m2/repository/org/apache/htrace/htrace-hbase/4.1.0-incubating-SNAPSHOT/htrace-hbase-4.1.0-incubating-SNAPSHOT.pom
[INFO] Installing <https://builds.apache.org/job/HTrace-Master/ws/htrace-hbase/target/htrace-hbase-4.1.0-incubating-SNAPSHOT-sources.jar>
to /home/jenkins/.m2/repository/org/apache/htrace/htrace-hbase/4.1.0-incubating-SNAPSHOT/htrace-hbase-4.1.0-incubating-SNAPSHOT-sources.jar
[INFO] Installing <https://builds.apache.org/job/HTrace-Master/ws/htrace-hbase/target/htrace-hbase-4.1.0-incubating-SNAPSHOT-javadoc.jar>
to /home/jenkins/.m2/repository/org/apache/htrace/htrace-hbase/4.1.0-incubating-SNAPSHOT/htrace-hbase-4.1.0-incubating-SNAPSHOT-javadoc.jar
[INFO] Installing <https://builds.apache.org/job/HTrace-Master/ws/htrace-hbase/target/htrace-hbase-4.1.0-incubating-SNAPSHOT-tests.jar>
to /home/jenkins/.m2/repository/org/apache/htrace/htrace-hbase/4.1.0-incubating-SNAPSHOT/htrace-hbase-4.1.0-incubating-SNAPSHOT-tests.jar
[INFO]                                                                         
[INFO] ------------------------------------------------------------------------
[INFO] Building htrace-flume 4.1.0-incubating-SNAPSHOT
[INFO] ------------------------------------------------------------------------
[INFO] 
[INFO] --- maven-remote-resources-plugin:1.4:process (default) @ htrace-flume ---
[INFO] 
[INFO] --- maven-resources-plugin:2.6:resources (default-resources) @ htrace-flume ---
[INFO] Using 'UTF-8' encoding to copy filtered resources.
[INFO] skip non existing resourceDirectory <https://builds.apache.org/job/HTrace-Master/ws/htrace-flume/src/main/resources>
[INFO] Copying 3 resources
[INFO] 
[INFO] --- maven-compiler-plugin:2.5.1:compile (default-compile) @ htrace-flume ---
[INFO] Compiling 1 source file to <https://builds.apache.org/job/HTrace-Master/ws/htrace-flume/target/classes>
[INFO] 
[INFO] --- maven-resources-plugin:2.6:testResources (default-testResources) @ htrace-flume
---
[INFO] Using 'UTF-8' encoding to copy filtered resources.
[INFO] skip non existing resourceDirectory <https://builds.apache.org/job/HTrace-Master/ws/htrace-flume/src/test/resources>
[INFO] Copying 3 resources
[INFO] 
[INFO] --- maven-compiler-plugin:2.5.1:testCompile (default-testCompile) @ htrace-flume ---
[INFO] Compiling 2 source files to <https://builds.apache.org/job/HTrace-Master/ws/htrace-flume/target/test-classes>
[INFO] 
[INFO] --- maven-surefire-plugin:2.12.4:test (default-test) @ htrace-flume ---
[INFO] Surefire report directory: <https://builds.apache.org/job/HTrace-Master/ws/htrace-flume/target/surefire-reports>

-------------------------------------------------------
 T E S T S
-------------------------------------------------------
Running org.apache.htrace.impl.TestFlumeSpanReceiver
Tests run: 3, Failures: 0, Errors: 0, Skipped: 0, Time elapsed: 14.844 sec

Results :

Tests run: 3, Failures: 0, Errors: 0, Skipped: 0

[INFO] 
[INFO] --- maven-jar-plugin:2.4:jar (default-jar) @ htrace-flume ---
[INFO] Building jar: <https://builds.apache.org/job/HTrace-Master/ws/htrace-flume/target/htrace-flume-4.1.0-incubating-SNAPSHOT.jar>
[INFO] 
[INFO] --- maven-source-plugin:2.1.2:jar-no-fork (attach-sources) @ htrace-flume ---
[INFO] META-INF already added, skipping
[INFO] META-INF/NOTICE already added, skipping
[INFO] META-INF/DEPENDENCIES already added, skipping
[INFO] META-INF/LICENSE already added, skipping
[INFO] Building jar: <https://builds.apache.org/job/HTrace-Master/ws/htrace-flume/target/htrace-flume-4.1.0-incubating-SNAPSHOT-sources.jar>
[INFO] META-INF already added, skipping
[INFO] META-INF/NOTICE already added, skipping
[INFO] META-INF/DEPENDENCIES already added, skipping
[INFO] META-INF/LICENSE already added, skipping
[INFO] 
[INFO] --- maven-javadoc-plugin:2.8.1:jar (attach-javadocs) @ htrace-flume ---
[INFO] 
Loading source files for package org.apache.htrace.impl...
Constructing Javadoc information...
Standard Doclet version 1.7.0_51
Building tree for all the packages and classes...
Generating <https://builds.apache.org/job/HTrace-Master/ws/htrace-flume/target/apidocs/org/apache/htrace/impl/FlumeSpanReceiver.html...>
Generating <https://builds.apache.org/job/HTrace-Master/ws/htrace-flume/target/apidocs/org/apache/htrace/impl/package-frame.html...>
Generating <https://builds.apache.org/job/HTrace-Master/ws/htrace-flume/target/apidocs/org/apache/htrace/impl/package-summary.html...>
Generating <https://builds.apache.org/job/HTrace-Master/ws/htrace-flume/target/apidocs/org/apache/htrace/impl/package-tree.html...>
Generating <https://builds.apache.org/job/HTrace-Master/ws/htrace-flume/target/apidocs/constant-values.html...>
Generating <https://builds.apache.org/job/HTrace-Master/ws/htrace-flume/target/apidocs/org/apache/htrace/impl/class-use/FlumeSpanReceiver.html...>
Generating <https://builds.apache.org/job/HTrace-Master/ws/htrace-flume/target/apidocs/org/apache/htrace/impl/package-use.html...>
Building index for all the packages and classes...
Generating <https://builds.apache.org/job/HTrace-Master/ws/htrace-flume/target/apidocs/overview-tree.html...>
Generating <https://builds.apache.org/job/HTrace-Master/ws/htrace-flume/target/apidocs/index-all.html...>
Generating <https://builds.apache.org/job/HTrace-Master/ws/htrace-flume/target/apidocs/deprecated-list.html...>
Building index for all classes...
Generating <https://builds.apache.org/job/HTrace-Master/ws/htrace-flume/target/apidocs/allclasses-frame.html...>
Generating <https://builds.apache.org/job/HTrace-Master/ws/htrace-flume/target/apidocs/allclasses-noframe.html...>
Generating <https://builds.apache.org/job/HTrace-Master/ws/htrace-flume/target/apidocs/index.html...>
Generating <https://builds.apache.org/job/HTrace-Master/ws/htrace-flume/target/apidocs/help-doc.html...>
[INFO] Building jar: <https://builds.apache.org/job/HTrace-Master/ws/htrace-flume/target/htrace-flume-4.1.0-incubating-SNAPSHOT-javadoc.jar>
[INFO] 
[INFO] --- apache-rat-plugin:0.11:check (default) @ htrace-flume ---
[INFO] 51 implicit excludes (use -debug for more details).
[INFO] Exclude: **/.settings/**
[INFO] Exclude: **/dependency-reduced-pom.xml
[INFO] Exclude: **/generated/**
[INFO] Exclude: */.settings/*
[INFO] Exclude: */generated/*
[INFO] Exclude: .git/**
[INFO] Exclude: **/README.md
[INFO] Exclude: **/go/bin/*
[INFO] Exclude: **/go/pkg/*
[INFO] Exclude: style.txt
[INFO] Exclude: **/bootstrap-3.3.1/**
[INFO] Exclude: **/web/lib/**
[INFO] Exclude: **/*.min.js
[INFO] Exclude: **/d3.min.js
[INFO] Exclude: **/backbone-*.js
[INFO] Exclude: **/jquery-*.js
[INFO] Exclude: **/moment-*.js
[INFO] Exclude: **/underscore-*.js
[INFO] Exclude: **/build/src/**
[INFO] Exclude: **/build/pkg/**
[INFO] Exclude: **/Godeps/**
[INFO] 4 resources included (use -debug for more details)
Warning:  org.apache.xerces.jaxp.SAXParserImpl$JAXPSAXParser: Property 'http://www.oracle.com/xml/jaxp/properties/entityExpansionLimit'
is not recognized.
Compiler warnings:
  WARNING:  'org.apache.xerces.jaxp.SAXParserImpl: Property 'http://javax.xml.XMLConstants/property/accessExternalDTD'
is not recognized.'
Warning:  org.apache.xerces.parsers.SAXParser: Feature 'http://javax.xml.XMLConstants/feature/secure-processing'
is not recognized.
Warning:  org.apache.xerces.parsers.SAXParser: Property 'http://javax.xml.XMLConstants/property/accessExternalDTD'
is not recognized.
Warning:  org.apache.xerces.parsers.SAXParser: Property 'http://www.oracle.com/xml/jaxp/properties/entityExpansionLimit'
is not recognized.
[INFO] Rat check: Summary of files. Unapproved: 0 unknown: 0 generated: 0 approved: 4 licence.
[INFO] 
[INFO] --- maven-site-plugin:3.4:attach-descriptor (attach-descriptor) @ htrace-flume ---
[INFO] 
[INFO] --- maven-jar-plugin:2.4:test-jar (default) @ htrace-flume ---
[INFO] Building jar: <https://builds.apache.org/job/HTrace-Master/ws/htrace-flume/target/htrace-flume-4.1.0-incubating-SNAPSHOT-tests.jar>
[INFO] 
[INFO] --- maven-install-plugin:2.3.1:install (default-install) @ htrace-flume ---
[INFO] Installing <https://builds.apache.org/job/HTrace-Master/ws/htrace-flume/target/htrace-flume-4.1.0-incubating-SNAPSHOT.jar>
to /home/jenkins/.m2/repository/org/apache/htrace/htrace-flume/4.1.0-incubating-SNAPSHOT/htrace-flume-4.1.0-incubating-SNAPSHOT.jar
[INFO] Installing <https://builds.apache.org/job/HTrace-Master/ws/htrace-flume/pom.xml>
to /home/jenkins/.m2/repository/org/apache/htrace/htrace-flume/4.1.0-incubating-SNAPSHOT/htrace-flume-4.1.0-incubating-SNAPSHOT.pom
[INFO] Installing <https://builds.apache.org/job/HTrace-Master/ws/htrace-flume/target/htrace-flume-4.1.0-incubating-SNAPSHOT-sources.jar>
to /home/jenkins/.m2/repository/org/apache/htrace/htrace-flume/4.1.0-incubating-SNAPSHOT/htrace-flume-4.1.0-incubating-SNAPSHOT-sources.jar
[INFO] Installing <https://builds.apache.org/job/HTrace-Master/ws/htrace-flume/target/htrace-flume-4.1.0-incubating-SNAPSHOT-javadoc.jar>
to /home/jenkins/.m2/repository/org/apache/htrace/htrace-flume/4.1.0-incubating-SNAPSHOT/htrace-flume-4.1.0-incubating-SNAPSHOT-javadoc.jar
[INFO] Installing <https://builds.apache.org/job/HTrace-Master/ws/htrace-flume/target/htrace-flume-4.1.0-incubating-SNAPSHOT-tests.jar>
to /home/jenkins/.m2/repository/org/apache/htrace/htrace-flume/4.1.0-incubating-SNAPSHOT/htrace-flume-4.1.0-incubating-SNAPSHOT-tests.jar
[INFO]                                                                         
[INFO] ------------------------------------------------------------------------
[INFO] Building htrace-htraced 4.1.0-incubating-SNAPSHOT
[INFO] ------------------------------------------------------------------------
[INFO] 
[INFO] --- maven-remote-resources-plugin:1.4:process (default) @ htrace-htraced ---
[INFO] 
[INFO] --- maven-resources-plugin:2.6:resources (default-resources) @ htrace-htraced ---
[INFO] Using 'UTF-8' encoding to copy filtered resources.
[INFO] skip non existing resourceDirectory <https://builds.apache.org/job/HTrace-Master/ws/htrace-htraced/src/main/resources>
[INFO] Copying 3 resources
[INFO] 
[INFO] --- maven-compiler-plugin:2.5.1:compile (default-compile) @ htrace-htraced ---
[INFO] Compiling 1 source file to <https://builds.apache.org/job/HTrace-Master/ws/htrace-htraced/target/classes>
[INFO] 
[INFO] --- maven-antrun-plugin:1.6:run (go_compile) @ htrace-htraced ---
[WARNING] Parameter tasks is deprecated, use target instead
[INFO] Executing tasks

main:
     [exec] You must install the leveldb-devel package (or distro-specific equivalent.)
[INFO] ------------------------------------------------------------------------
[INFO] Reactor Summary:
[INFO] 
[INFO] Apache HTrace ..................................... SUCCESS [1.919s]
[INFO] htrace-c .......................................... SUCCESS [0.694s]
[INFO] htrace-core ....................................... SUCCESS [19.994s]
[INFO] htrace-webapp ..................................... SUCCESS [0.546s]
[INFO] htrace-zipkin ..................................... SUCCESS [8.048s]
[INFO] htrace-hbase ...................................... SUCCESS [29.378s]
[INFO] htrace-flume ...................................... SUCCESS [19.082s]
[INFO] htrace-htraced .................................... FAILURE [1.262s]
[INFO] ------------------------------------------------------------------------
[INFO] BUILD FAILURE
[INFO] ------------------------------------------------------------------------
[INFO] Total time: 1:21.315s
[INFO] Finished at: Wed Sep 09 01:52:58 UTC 2015
[INFO] Final Memory: 67M/1737M
[INFO] ------------------------------------------------------------------------
[ERROR] Failed to execute goal org.apache.maven.plugins:maven-antrun-plugin:1.6:run (go_compile)
on project htrace-htraced: An Ant BuildException has occured: exec returned: 1 -> [Help
1]
[ERROR] 
[ERROR] To see the full stack trace of the errors, re-run Maven with the -e switch.
[ERROR] Re-run Maven using the -X switch to enable full debug logging.
[ERROR] 
[ERROR] For more information about the errors and possible solutions, please read the following
articles:
[ERROR] [Help 1] http://cwiki.apache.org/confluence/display/MAVEN/MojoExecutionException
[ERROR] 
[ERROR] After correcting the problems, you can resume the build with the command
[ERROR]   mvn <goals> -rf :htrace-htraced
Build step 'Invoke top-level Maven targets' marked build as failure
[FINDBUGS] Skipping publisher since build result is FAILURE
Performing Post build task...
Match found for :.* : True
Logical operation result is TRUE
Running script  : 
[HTrace-Master] $ /bin/bash -xe /tmp/hudson2648427887695945972.sh
POST BUILD TASK : SUCCESS
END OF POST BUILD TASK : 0
Archiving artifacts
No prior successful build to compare, so performing full copy of artifacts
Recording test results
Updating HTRACE-243

Mime
View raw message