htrace-dev mailing list archives

Site index · List index
Message view « Date » · « Thread »
Top « Date » · « Thread »
From Apache Jenkins Server <jenk...@builds.apache.org>
Subject Build failed in Jenkins: HTrace-Master #110
Date Fri, 18 Sep 2015 19:59:17 GMT
See <https://builds.apache.org/job/HTrace-Master/110/changes>

Changes:

[cmccabe] HTRACE-253. Tracer loadSamplers and loadSpanReceivers logs are too chatty (cmccabe)

------------------------------------------
[...truncated 33797 lines...]
1136/1889 KB   
1140/1889 KB   
1144/1889 KB   
1148/1889 KB   
1152/1889 KB   
1156/1889 KB   
1160/1889 KB   
1164/1889 KB   
1168/1889 KB   
1172/1889 KB   
1176/1889 KB   
1180/1889 KB   
1184/1889 KB   
1188/1889 KB   
1192/1889 KB   
1196/1889 KB   
1200/1889 KB   
1204/1889 KB   
1208/1889 KB   
1212/1889 KB   
1216/1889 KB   
1220/1889 KB   
1224/1889 KB   
1228/1889 KB   
1232/1889 KB   
1236/1889 KB   
1240/1889 KB   
1244/1889 KB   
1248/1889 KB   
1252/1889 KB   
1256/1889 KB   
1260/1889 KB   
1264/1889 KB   
1268/1889 KB   
1272/1889 KB   
1276/1889 KB   
1280/1889 KB   
1284/1889 KB   
1288/1889 KB   
1292/1889 KB   
1296/1889 KB   
1300/1889 KB   
1304/1889 KB   
1308/1889 KB   
1312/1889 KB   
1316/1889 KB   
1320/1889 KB   
1324/1889 KB   
1328/1889 KB   
1332/1889 KB   
1336/1889 KB   
1340/1889 KB   
1344/1889 KB   
1348/1889 KB   
1352/1889 KB   
1356/1889 KB   
1360/1889 KB   
1364/1889 KB   
1364/1889 KB   
1365/1889 KB   
1369/1889 KB   
1373/1889 KB   
1377/1889 KB   
1381/1889 KB   
1385/1889 KB   
1389/1889 KB   
1393/1889 KB   
1397/1889 KB   
1401/1889 KB   
1405/1889 KB   
1409/1889 KB   
1413/1889 KB   
1417/1889 KB   
1421/1889 KB   
1425/1889 KB   
1429/1889 KB   
1433/1889 KB   
1437/1889 KB   
1441/1889 KB   
1445/1889 KB   
1449/1889 KB   
1453/1889 KB   
1457/1889 KB   
1461/1889 KB   
1465/1889 KB   
1469/1889 KB   
1473/1889 KB   
1477/1889 KB   
1481/1889 KB   
1485/1889 KB   
1489/1889 KB   
1493/1889 KB   
1497/1889 KB   
1501/1889 KB   
1505/1889 KB   
1509/1889 KB   
1513/1889 KB   
1517/1889 KB   
1521/1889 KB   
1525/1889 KB   
1529/1889 KB   
1533/1889 KB   
1537/1889 KB   
1541/1889 KB   
1545/1889 KB   
1549/1889 KB   
1553/1889 KB   
1557/1889 KB   
1561/1889 KB   
1565/1889 KB   
1569/1889 KB   
1573/1889 KB   
1577/1889 KB   
1581/1889 KB   
1585/1889 KB   
1589/1889 KB   
1593/1889 KB   
1597/1889 KB   
1601/1889 KB   
1605/1889 KB   
1609/1889 KB   
1613/1889 KB   
1617/1889 KB   
1621/1889 KB   
1625/1889 KB   
1629/1889 KB   
1633/1889 KB   
1637/1889 KB   
1641/1889 KB   
1645/1889 KB   
1649/1889 KB   
1653/1889 KB   
1657/1889 KB   
1661/1889 KB   
1665/1889 KB   
1669/1889 KB   
1673/1889 KB   
1677/1889 KB   
1681/1889 KB   
1685/1889 KB   
1689/1889 KB   
1693/1889 KB   
1697/1889 KB   
1701/1889 KB   
1705/1889 KB   
1709/1889 KB   
1713/1889 KB   
1717/1889 KB   
1721/1889 KB   
1725/1889 KB   
1729/1889 KB   
1733/1889 KB   
1737/1889 KB   
1741/1889 KB   
1745/1889 KB   
1749/1889 KB   
1753/1889 KB   
1757/1889 KB   
1761/1889 KB   
1765/1889 KB   
1769/1889 KB   
1773/1889 KB   
1777/1889 KB   
1781/1889 KB   
1785/1889 KB   
1789/1889 KB   
1793/1889 KB   
1797/1889 KB   
1801/1889 KB   
1805/1889 KB   
1809/1889 KB   
1813/1889 KB   
1817/1889 KB   
1821/1889 KB   
1825/1889 KB   
1829/1889 KB   
1833/1889 KB   
1837/1889 KB   
1841/1889 KB   
1845/1889 KB   
1849/1889 KB   
1853/1889 KB   
1857/1889 KB   
1861/1889 KB   
1865/1889 KB   
1869/1889 KB   
1873/1889 KB   
1877/1889 KB   
1881/1889 KB   
1885/1889 KB   
1889/1889 KB   
               
Downloaded: http://repo.maven.apache.org/maven2/org/apache/ant/ant/1.8.2/ant-1.8.2.jar (1889
KB at 6337.0 KB/sec)
[WARNING] Parameter tasks is deprecated, use target instead
[INFO] Executing tasks

main:
     [exec] Installing godep...
     [exec] godep: open Godeps/Godeps.json: no such file or directory
     [exec] godep restore...
     [exec] failed to set up dependencies
[INFO] ------------------------------------------------------------------------
[INFO] Reactor Summary:
[INFO] 
[INFO] Apache HTrace ..................................... SUCCESS [1:00.539s]
[INFO] htrace-c .......................................... SUCCESS [6.325s]
[INFO] htrace-core ....................................... SUCCESS [28.150s]
[INFO] htrace-webapp ..................................... SUCCESS [4.859s]
[INFO] htrace-zipkin ..................................... SUCCESS [21.211s]
[INFO] htrace-hbase ...................................... SUCCESS [42.131s]
[INFO] htrace-flume ...................................... SUCCESS [27.981s]
[INFO] htrace-htraced .................................... FAILURE [7.363s]
[INFO] ------------------------------------------------------------------------
[INFO] BUILD FAILURE
[INFO] ------------------------------------------------------------------------
[INFO] Total time: 3:18.967s
[INFO] Finished at: Fri Sep 18 19:59:26 UTC 2015
[INFO] Final Memory: 59M/704M
[INFO] ------------------------------------------------------------------------
[ERROR] Failed to execute goal org.apache.maven.plugins:maven-antrun-plugin:1.7:run (go_compile)
on project htrace-htraced: An Ant BuildException has occured: exec returned: 1
[ERROR] around Ant part ...<exec dir="/htrace/htrace-htraced//go/" executable="./gobuild.sh"
failonerror="true">... @ 4:88 in /htrace/htrace-htraced/target/antrun/build-main.xml
[ERROR] -> [Help 1]
[ERROR] 
[ERROR] To see the full stack trace of the errors, re-run Maven with the -e switch.
[ERROR] Re-run Maven using the -X switch to enable full debug logging.
[ERROR] 
[ERROR] For more information about the errors and possible solutions, please read the following
articles:
[ERROR] [Help 1] http://cwiki.apache.org/confluence/display/MAVEN/MojoExecutionException
[ERROR] 
[ERROR] After correcting the problems, you can resume the build with the command
[ERROR]   mvn <goals> -rf :htrace-htraced
Build step 'Execute shell' marked build as failure
[FINDBUGS] Skipping publisher since build result is FAILURE
Performing Post build task...
Match found for :.* : True
Logical operation result is TRUE
Running script  : 
[HTrace-Master] $ /bin/bash -xe /tmp/hudson7485112586901601725.sh
POST BUILD TASK : SUCCESS
END OF POST BUILD TASK : 0
Archiving artifacts
Sending artifact delta relative to HTrace-Master #109
Archived 160 artifacts
Archive block size is 32768
Received 2 blocks and 1622613 bytes
Compression is 3.9%
Took 0.83 sec
Recording test results
Updating HTRACE-253

Mime
View raw message