htrace-dev mailing list archives

Site index · List index
Message view « Date » · « Thread »
Top « Date » · « Thread »
From Apache Jenkins Server <jenk...@builds.apache.org>
Subject Build failed in Jenkins: HTrace-Master #113
Date Fri, 18 Sep 2015 21:55:32 GMT
See <https://builds.apache.org/job/HTrace-Master/113/changes>

Changes:

[stack] HTRACE-256 Change the artifactId for htrace-core in branch 4.0 to be htrace-core4

[stack] HTRACE-245 NOTICE.txt: change "developed by The Apache Software...” to "developed
at The Apache Software...”

------------------------------------------
[...truncated 14646 lines...]
15/15 KB   24/32 KB   37/37 KB   
15/15 KB   28/32 KB   37/37 KB   
15/15 KB   32/32 KB   37/37 KB   
15/15 KB   32/32 KB   37/37 KB   3/139 KB   
15/15 KB   32/32 KB   37/37 KB   7/139 KB   
15/15 KB   32/32 KB   37/37 KB   11/139 KB   
15/15 KB   32/32 KB   37/37 KB   15/139 KB   
15/15 KB   32/32 KB   37/37 KB   19/139 KB   
15/15 KB   32/32 KB   37/37 KB   23/139 KB   
15/15 KB   32/32 KB   37/37 KB   27/139 KB   
15/15 KB   32/32 KB   37/37 KB   31/139 KB   
15/15 KB   32/32 KB   37/37 KB   35/139 KB   
15/15 KB   32/32 KB   37/37 KB   39/139 KB   
15/15 KB   32/32 KB   37/37 KB   43/139 KB   
15/15 KB   32/32 KB   37/37 KB   47/139 KB   
15/15 KB   32/32 KB   37/37 KB   51/139 KB   
15/15 KB   32/32 KB   37/37 KB   55/139 KB   
15/15 KB   32/32 KB   37/37 KB   59/139 KB   
15/15 KB   32/32 KB   37/37 KB   63/139 KB   
15/15 KB   32/32 KB   37/37 KB   67/139 KB   
15/15 KB   32/32 KB   37/37 KB   71/139 KB   
15/15 KB   32/32 KB   37/37 KB   75/139 KB   
15/15 KB   32/32 KB   37/37 KB   79/139 KB   
15/15 KB   32/32 KB   37/37 KB   83/139 KB   
15/15 KB   32/32 KB   37/37 KB   87/139 KB   
15/15 KB   32/32 KB   37/37 KB   91/139 KB   
15/15 KB   32/32 KB   37/37 KB   95/139 KB   
15/15 KB   32/32 KB   37/37 KB   99/139 KB   
15/15 KB   32/32 KB   37/37 KB   103/139 KB   
15/15 KB   32/32 KB   37/37 KB   107/139 KB   
15/15 KB   32/32 KB   37/37 KB   111/139 KB   
15/15 KB   32/32 KB   37/37 KB   115/139 KB   
15/15 KB   32/32 KB   37/37 KB   119/139 KB   
15/15 KB   32/32 KB   37/37 KB   123/139 KB   
15/15 KB   32/32 KB   37/37 KB   127/139 KB   
15/15 KB   32/32 KB   37/37 KB   131/139 KB   
15/15 KB   32/32 KB   37/37 KB   135/139 KB   
15/15 KB   32/32 KB   37/37 KB   139/139 KB   
15/15 KB   32/32 KB   3/227 KB   37/37 KB   139/139 KB   
15/15 KB   32/32 KB   7/227 KB   37/37 KB   139/139 KB   
15/15 KB   32/32 KB   11/227 KB   37/37 KB   139/139 KB   
15/15 KB   32/32 KB   15/227 KB   37/37 KB   139/139 KB   
15/15 KB   32/32 KB   19/227 KB   37/37 KB   139/139 KB   
15/15 KB   32/32 KB   23/227 KB   37/37 KB   139/139 KB   
15/15 KB   32/32 KB   27/227 KB   37/37 KB   139/139 KB   
15/15 KB   32/32 KB   31/227 KB   37/37 KB   139/139 KB   
15/15 KB   32/32 KB   35/227 KB   37/37 KB   139/139 KB   
15/15 KB   32/32 KB   39/227 KB   37/37 KB   139/139 KB   
15/15 KB   32/32 KB   43/227 KB   37/37 KB   139/139 KB   
15/15 KB   32/32 KB   47/227 KB   37/37 KB   139/139 KB   
15/15 KB   32/32 KB   51/227 KB   37/37 KB   139/139 KB   
15/15 KB   32/32 KB   55/227 KB   37/37 KB   139/139 KB   
15/15 KB   32/32 KB   59/227 KB   37/37 KB   139/139 KB   
15/15 KB   32/32 KB   63/227 KB   37/37 KB   139/139 KB   
15/15 KB   32/32 KB   67/227 KB   37/37 KB   139/139 KB   
15/15 KB   32/32 KB   71/227 KB   37/37 KB   139/139 KB   
15/15 KB   32/32 KB   75/227 KB   37/37 KB   139/139 KB   
15/15 KB   32/32 KB   79/227 KB   37/37 KB   139/139 KB   
15/15 KB   32/32 KB   83/227 KB   37/37 KB   139/139 KB   
15/15 KB   32/32 KB   87/227 KB   37/37 KB   139/139 KB   
15/15 KB   32/32 KB   91/227 KB   37/37 KB   139/139 KB   
15/15 KB   32/32 KB   95/227 KB   37/37 KB   139/139 KB   
15/15 KB   32/32 KB   99/227 KB   37/37 KB   139/139 KB   
15/15 KB   32/32 KB   103/227 KB   37/37 KB   139/139 KB   
15/15 KB   32/32 KB   107/227 KB   37/37 KB   139/139 KB   
15/15 KB   32/32 KB   111/227 KB   37/37 KB   139/139 KB   
15/15 KB   32/32 KB   115/227 KB   37/37 KB   139/139 KB   
15/15 KB   32/32 KB   119/227 KB   37/37 KB   139/139 KB   
                                                           
Downloaded: http://repo.maven.apache.org/maven2/org/apache/maven/doxia/doxia-module-xhtml/1.2/doxia-module-xhtml-1.2.jar
(15 KB at 201.9 KB/sec)
                                                           
Downloaded: http://repo.maven.apache.org/maven2/org/apache/maven/doxia/doxia-module-fml/1.2/doxia-module-fml-1.2.jar
(37 KB at 506.4 KB/sec)
                                                           
Downloaded: http://repo.maven.apache.org/maven2/org/apache/maven/shared/maven-plugin-testing-harness/1.1/maven-plugin-testing-harness-1.1.jar
(32 KB at 434.7 KB/sec)
                                                           
Downloaded: http://repo.maven.apache.org/maven2/org/codehaus/plexus/plexus-archiver/1.0-alpha-7/plexus-archiver-1.0-alpha-7.jar
(139 KB at 2617.1 KB/sec)
123/227 KB                                                 
127/227 KB   
131/227 KB   
132/227 KB   
136/227 KB   
140/227 KB   
144/227 KB   
148/227 KB   
152/227 KB   
156/227 KB   
160/227 KB   
164/227 KB   
168/227 KB   
172/227 KB   
176/227 KB   
180/227 KB   
184/227 KB   
188/227 KB   
192/227 KB   
196/227 KB   
200/227 KB   
204/227 KB   
208/227 KB   
212/227 KB   
216/227 KB   
220/227 KB   
224/227 KB   
227/227 KB   
             
Downloaded: http://repo.maven.apache.org/maven2/org/codehaus/plexus/plexus-utils/3.0.8/plexus-utils-3.0.8.jar
(227 KB at 3059.3 KB/sec)
[INFO] 51 implicit excludes (use -debug for more details).
[INFO] Exclude: **/.settings/**
[INFO] Exclude: **/dependency-reduced-pom.xml
[INFO] Exclude: **/generated/**
[INFO] Exclude: */.settings/*
[INFO] Exclude: */generated/*
[INFO] Exclude: .git/**
[INFO] Exclude: **/README.md
[INFO] Exclude: **/go/bin/*
[INFO] Exclude: **/go/pkg/*
[INFO] Exclude: style.txt
[INFO] Exclude: **/bootstrap-3.3.1/**
[INFO] Exclude: **/web/lib/**
[INFO] Exclude: **/*.min.js
[INFO] Exclude: **/d3.min.js
[INFO] Exclude: **/backbone-*.js
[INFO] Exclude: **/jquery-*.js
[INFO] Exclude: **/moment-*.js
[INFO] Exclude: **/underscore-*.js
[INFO] Exclude: **/build/src/**
[INFO] Exclude: **/build/pkg/**
[INFO] Exclude: **/Godeps/**
[INFO] 37 resources included (use -debug for more details)
[INFO] Rat check: Summary of files. Unapproved: 0 unknown: 0 generated: 0 approved: 37 licence.
[INFO] 
[INFO] --- maven-site-plugin:3.4:attach-descriptor (attach-descriptor) @ htrace-core4 ---
[INFO] 
[INFO] --- maven-install-plugin:2.5.2:install (default-install) @ htrace-core4 ---
[INFO] Installing /htrace/htrace-core/target/htrace-core4-4.1.0-incubating-SNAPSHOT.jar to
/root/.m2/repository/org/apache/htrace/htrace-core4/4.1.0-incubating-SNAPSHOT/htrace-core4-4.1.0-incubating-SNAPSHOT.jar
[INFO] Installing /htrace/htrace-core/dependency-reduced-pom.xml to /root/.m2/repository/org/apache/htrace/htrace-core4/4.1.0-incubating-SNAPSHOT/htrace-core4-4.1.0-incubating-SNAPSHOT.pom
[INFO] Installing /htrace/htrace-core/target/htrace-core4-4.1.0-incubating-SNAPSHOT-sources.jar
to /root/.m2/repository/org/apache/htrace/htrace-core4/4.1.0-incubating-SNAPSHOT/htrace-core4-4.1.0-incubating-SNAPSHOT-sources.jar
[INFO] Installing /htrace/htrace-core/target/htrace-core4-4.1.0-incubating-SNAPSHOT-javadoc.jar
to /root/.m2/repository/org/apache/htrace/htrace-core4/4.1.0-incubating-SNAPSHOT/htrace-core4-4.1.0-incubating-SNAPSHOT-javadoc.jar
[INFO] Installing /htrace/htrace-core/target/htrace-core4-4.1.0-incubating-SNAPSHOT-tests.jar
to /root/.m2/repository/org/apache/htrace/htrace-core4/4.1.0-incubating-SNAPSHOT/htrace-core4-4.1.0-incubating-SNAPSHOT-tests.jar
[INFO] 
[INFO] --- maven-site-plugin:3.4:site (default-site) @ htrace-core4 ---
[INFO] configuring report plugin org.apache.maven.plugins:maven-project-info-reports-plugin:2.8
[INFO] Parent project loaded from repository: org.apache:apache:pom:17
[INFO] Relativizing decoration links with respect to project URL: http://incubator.apache.org/projects/htrace.html
[INFO] Rendering site with lt.velykis.maven.skins:reflow-maven-skin:jar:1.1.1 skin.
[INFO] Generating "Continuous Integration" report --- maven-project-info-reports-plugin:2.8:cim
[INFO] Generating "Dependencies" report         --- maven-project-info-reports-plugin:2.8:dependencies
[INFO] Generating "Dependency Information" report --- maven-project-info-reports-plugin:2.8:dependency-info
[INFO] Generating "Dependency Management" report --- maven-project-info-reports-plugin:2.8:dependency-management
[INFO] Generating "Distribution Management" report --- maven-project-info-reports-plugin:2.8:distribution-management
[INFO] Generating "About" report                --- maven-project-info-reports-plugin:2.8:index
[INFO] Generating "Issue Tracking" report       --- maven-project-info-reports-plugin:2.8:issue-tracking
[INFO] Generating "Project License" report      --- maven-project-info-reports-plugin:2.8:license
[INFO] Generating "Mailing Lists" report        --- maven-project-info-reports-plugin:2.8:mailing-list
[INFO] Generating "Plugin Management" report    --- maven-project-info-reports-plugin:2.8:plugin-management
[INFO] Generating "Project Plugins" report      --- maven-project-info-reports-plugin:2.8:plugins
[INFO] Generating "Project Team" report         --- maven-project-info-reports-plugin:2.8:project-team
[INFO] Generating "Source Repository" report    --- maven-project-info-reports-plugin:2.8:scm
[WARNING] Wrong effective scm url http://git-wip-us.apache.org/repos/asf/incubator-htrace.git/htrace-core4:
removing /htrace-core4 in report, but this should be configured in pom.xml.
[WARNING] Wrong effective scm url https://git-wip-us.apache.org/repos/asf/incubator-htrace.git/htrace-core4:
removing /htrace-core4 in report, but this should be configured in pom.xml.
[INFO] Generating "Project Summary" report      --- maven-project-info-reports-plugin:2.8:summary
[INFO]                                                                         
[INFO] ------------------------------------------------------------------------
[INFO] Building htrace-webapp 4.1.0-incubating-SNAPSHOT
[INFO] ------------------------------------------------------------------------
Downloading: http://repo.maven.apache.org/maven2/org/apache/maven/plugins/maven-war-plugin/2.6/maven-war-plugin-2.6.pom
4/9 KB       
8/9 KB   
9/9 KB   
         
Downloaded: http://repo.maven.apache.org/maven2/org/apache/maven/plugins/maven-war-plugin/2.6/maven-war-plugin-2.6.pom
(9 KB at 154.5 KB/sec)
Downloading: http://repo.maven.apache.org/maven2/org/apache/maven/plugins/maven-war-plugin/2.6/maven-war-plugin-2.6.jar
4/86 KB   
8/86 KB   
12/86 KB   
16/86 KB   
20/86 KB   
24/86 KB   
28/86 KB   
32/86 KB   
36/86 KB   
40/86 KB   
44/86 KB   
48/86 KB   
52/86 KB   
56/86 KB   
60/86 KB   
64/86 KB   
68/86 KB   
72/86 KB   
76/86 KB   
80/86 KB   
84/86 KB   
86/86 KB   
           
Downloaded: http://repo.maven.apache.org/maven2/org/apache/maven/plugins/maven-war-plugin/2.6/maven-war-plugin-2.6.jar
(86 KB at 1616.1 KB/sec)
[WARNING] The POM for org.apache.htrace:htrace-core:jar:4.1.0-incubating-SNAPSHOT is missing,
no dependency information available
[WARNING] The POM for org.apache.htrace:htrace-core:jar:tests:4.1.0-incubating-SNAPSHOT is
missing, no dependency information available
Downloading: http://repository.apache.org/snapshots/org/apache/htrace/htrace-core/4.1.0-incubating-SNAPSHOT/htrace-core-4.1.0-incubating-SNAPSHOT.jar
Downloading: http://repository.apache.org/snapshots/org/apache/htrace/htrace-core/4.1.0-incubating-SNAPSHOT/htrace-core-4.1.0-incubating-SNAPSHOT-tests.jar
           
           
[INFO] ------------------------------------------------------------------------
[INFO] Reactor Summary:
[INFO] 
[INFO] Apache HTrace ..................................... SUCCESS [1:04.443s]
[INFO] htrace-c .......................................... SUCCESS [5.244s]
[INFO] htrace-core ....................................... SUCCESS [28.194s]
[INFO] htrace-webapp ..................................... FAILURE [0.182s]
[INFO] htrace-zipkin ..................................... SKIPPED
[INFO] htrace-hbase ...................................... SKIPPED
[INFO] htrace-flume ...................................... SKIPPED
[INFO] htrace-htraced .................................... SKIPPED
[INFO] ------------------------------------------------------------------------
[INFO] BUILD FAILURE
[INFO] ------------------------------------------------------------------------
[INFO] Total time: 1:38.525s
[INFO] Finished at: Fri Sep 18 21:55:43 UTC 2015
[INFO] Final Memory: 39M/789M
[INFO] ------------------------------------------------------------------------
[ERROR] Failed to execute goal on project htrace-webapp: Could not resolve dependencies for
project org.apache.htrace:htrace-webapp:war:4.1.0-incubating-SNAPSHOT: The following artifacts
could not be resolved: org.apache.htrace:htrace-core:jar:4.1.0-incubating-SNAPSHOT, org.apache.htrace:htrace-core:jar:tests:4.1.0-incubating-SNAPSHOT:
Could not find artifact org.apache.htrace:htrace-core:jar:4.1.0-incubating-SNAPSHOT in apache.snapshots
(http://repository.apache.org/snapshots) -> [Help 1]
[ERROR] 
[ERROR] To see the full stack trace of the errors, re-run Maven with the -e switch.
[ERROR] Re-run Maven using the -X switch to enable full debug logging.
[ERROR] 
[ERROR] For more information about the errors and possible solutions, please read the following
articles:
[ERROR] [Help 1] http://cwiki.apache.org/confluence/display/MAVEN/DependencyResolutionException
[ERROR] 
[ERROR] After correcting the problems, you can resume the build with the command
[ERROR]   mvn <goals> -rf :htrace-webapp
Build step 'Execute shell' marked build as failure
[FINDBUGS] Skipping publisher since build result is FAILURE
Performing Post build task...
Match found for :.* : True
Logical operation result is TRUE
Running script  : 
[HTrace-Master] $ /bin/bash -xe /tmp/hudson1441779244058258611.sh
POST BUILD TASK : SUCCESS
END OF POST BUILD TASK : 0
Archiving artifacts
Sending artifact delta relative to HTrace-Master #112
Archived 83 artifacts
Archive block size is 32768
Received 8 blocks and 364339 bytes
Compression is 41.8%
Took 0.17 sec
Recording test results
Updating HTRACE-245
Updating HTRACE-256

Mime
View raw message