htrace-dev mailing list archives

Site index · List index
Message view « Date » · « Thread »
Top « Date » · « Thread »
From Apache Jenkins Server <jenk...@builds.apache.org>
Subject Build failed in Jenkins: HTrace-Master #118
Date Sun, 20 Sep 2015 03:14:11 GMT
See <https://builds.apache.org/job/HTrace-Master/118/changes>

Changes:

[stack] HTRACE-256 Change the artifactId for htrace-core in branch 4.0 to be htrace-core4;
ADDENDUM

------------------------------------------
[...truncated 1123 lines...]
Unpacking java-common (0.51) ...
Setting up wget (1.15-1ubuntu1.14.04.1) ...
Selecting previously unselected package oracle-java7-installer.
(Reading database ... 19309 files and directories currently installed.)
Preparing to unpack .../oracle-java7-installer_7u80+7u60arm-0~webupd8~1_all.deb ...
oracle-license-v1-1 license has already been accepted
Unpacking oracle-java7-installer (7u80+7u60arm-0~webupd8~1) ...
Selecting previously unselected package gsfonts.
Preparing to unpack .../gsfonts_1%3a8.11+urwcyr1.0.7~pre44-4.2ubuntu1_all.deb ...
Unpacking gsfonts (1:8.11+urwcyr1.0.7~pre44-4.2ubuntu1) ...
Selecting previously unselected package x11-common.
Preparing to unpack .../x11-common_1%3a7.7+1ubuntu8.1_all.deb ...
Unpacking x11-common (1:7.7+1ubuntu8.1) ...
Selecting previously unselected package xfonts-encodings.
Preparing to unpack .../xfonts-encodings_1%3a1.0.4-1ubuntu1_all.deb ...
Unpacking xfonts-encodings (1:1.0.4-1ubuntu1) ...
Selecting previously unselected package xfonts-utils.
Preparing to unpack .../xfonts-utils_1%3a7.7+1_amd64.deb ...
Unpacking xfonts-utils (1:7.7+1) ...
Selecting previously unselected package gsfonts-x11.
Preparing to unpack .../gsfonts-x11_0.22_all.deb ...
Unpacking gsfonts-x11 (0.22) ...
Selecting previously unselected package oracle-java7-set-default.
Preparing to unpack .../oracle-java7-set-default_7u80+7u60arm-0~webupd8~1_all.deb ...
Unpacking oracle-java7-set-default (7u80+7u60arm-0~webupd8~1) ...
Processing triggers for mime-support (3.54ubuntu1.1) ...
Processing triggers for shared-mime-info (1.2-0ubuntu3) ...
Processing triggers for ureadahead (0.100.0-16) ...
Setting up libfontenc1:amd64 (1:1.1.2-1) ...
Setting up libfreetype6:amd64 (2.5.2-1ubuntu2.5) ...
Setting up libxfont1:amd64 (1:1.4.7-1ubuntu0.2) ...
Setting up java-common (0.51) ...
Setting up oracle-java7-installer (7u80+7u60arm-0~webupd8~1) ...
Downloading Oracle Java 7...
--2015-09-20 03:13:47--  http://download.oracle.com/otn-pub/java/jdk/7u80-b15/jdk-7u80-linux-x64.tar.gz
Resolving download.oracle.com (download.oracle.com)... 184.25.56.53, 184.25.56.36
Connecting to download.oracle.com (download.oracle.com)|184.25.56.53|:80... connected.
HTTP request sent, awaiting response... 302 Moved Temporarily
Location: https://edelivery.oracle.com/otn-pub/java/jdk/7u80-b15/jdk-7u80-linux-x64.tar.gz
[following]
--2015-09-20 03:13:47--  https://edelivery.oracle.com/otn-pub/java/jdk/7u80-b15/jdk-7u80-linux-x64.tar.gz
Resolving edelivery.oracle.com (edelivery.oracle.com)... 23.6.102.140
Connecting to edelivery.oracle.com (edelivery.oracle.com)|23.6.102.140|:443... connected.
HTTP request sent, awaiting response... 302 Moved Temporarily
Location: http://download.oracle.com/otn-pub/java/jdk/7u80-b15/jdk-7u80-linux-x64.tar.gz?AuthParam=1442718947_564bdabeca066f3977a582d8f653d162
[following]
--2015-09-20 03:13:47--  http://download.oracle.com/otn-pub/java/jdk/7u80-b15/jdk-7u80-linux-x64.tar.gz?AuthParam=1442718947_564bdabeca066f3977a582d8f653d162
Connecting to download.oracle.com (download.oracle.com)|184.25.56.53|:80... connected.
HTTP request sent, awaiting response... 200 OK
Length: 153530841 (146M) [application/x-gzip]
Saving to: 'jdk-7u80-linux-x64.tar.gz'

     0K ........ ........
........ ........
........ ........
 2% 15.5M 9s
  3072K ........ ........
........ ........
........ ........
 4% 16.4M 9s
  6144K ........ ........
........ ........
........ ........
 6% 17.7M 8s
  9216K ........ ........
........ ........
........ ........
 8% 21.2M 8s
 12288K ........ ........
........ ........
........ ........
10% 17.6M 8s
 15360K ........ ........
........ ........
........ ........
12% 16.5M 7s
 18432K ........ ........
........ ........
........ ........
14% 16.8M 7s
 21504K ........ ........
........ ........
........ ........
16% 18.8M 7s
 24576K ........ ........
........ ........
........ ........
18% 17.8M 7s
 27648K ........ ........
........ ........
........ ........
20% 5.14M 8s
 30720K ........ ........
........ ........
........ ........
22% 11.6M 8s
 33792K ........ ........
........ ........
........ ........
24% 6.07M 9s
 36864K ........ ........
........ ........
........ ........
26% 4.81M 10s
 39936K ........ ........
........ ........
........ ........
28% 7.37M 10s
 43008K ........ ........
........ ........
........ ........
30% 8.04M 10s
 46080K ........ ........
........ ........
........ ........
32% 7.09M 10s
 49152K ........ ........
........ ........
........ ........
34% 15.2M 9s
 52224K ........ ........
........ ........
........ ........
36% 14.4M 9s
 55296K ........ ........
........ ........
........ ........
38% 14.0M 8s
 58368K ........ ........
........ ........
........ ........
40% 11.0M 8s
 61440K ........ ........
........ ........
........ ........
43% 9.03M 8s
 64512K ........ ........
........ ........
........ ........
45% 14.3M 7s
 67584K ........ ........
........ ........
........ ........
47% 16.7M 7s
 70656K ........ ........
........ ........
........ ........
49% 18.4M 7s
 73728K ........ ........
........ ........
........ ........
51% 19.6M 6s
 76800K ........ ........
........ ........
........ ........
53% 17.3M 6s
 79872K ........ ........
........ ........
........ ........
55% 18.7M 6s
 82944K ........ ........
........ ........
........ ........
57% 16.8M 5s
 86016K ........ ........
........ ........
........ ........
59% 18.7M 5s
 89088K ........ ........
........ ........
........ ........
61% 16.4M 5s
 92160K ........ ........
........ ........
........ ........
63% 17.0M 4s
 95232K ........ ........
........ ........
........ ........
65% 18.1M 4s
 98304K ........ ........
........ ........
........ ........
67% 18.4M 4s
101376K ........ ........
........ ........
........ ........
69% 18.5M 4s
104448K ........ ........
........ ........
........ ........
71% 17.7M 3s
107520K ........ ........
........ ........
........ ........
73% 17.8M 3s
110592K ........ ........
........ ........
........ ........
75% 17.1M 3s
113664K ........ ........
........ ........
........ ........
77% 18.1M 3s
116736K ........ ........
........ ........
........ ........
79% 17.9M 2s
119808K ........ ........
........ ........
........ ........
81% 17.1M 2s
122880K ........ ........
........ ........
........ ........
84% 9.25M 2s
125952K ........ ........
........ ........
........ ........
86% 13.3M 2s
129024K ........ ........
........ ........
........ ........
88% 9.46M 1s
132096K ........ ........
........ ........
........ ........
90% 7.23M 1s
135168K ........ ........
........ ........
........ ........
92% 4.22M 1s
138240K ........ ........
........ ........
........ ........
94% 12.5M 1s
141312K ........ ........
........ ........
........ ........
96% 4.53M 0s
144384K ........ ........
........ ........
........ ........
98% 15.2M 0s
147456K ........ ........
........ ........
......           100% 8.33M=13s

2015-09-20 03:14:00 (11.6 MB/s) - 'jdk-7u80-linux-x64.tar.gz' saved [153530841/153530841]

Download done.
Removing outdated cached downloads...
update-alternatives: error: no alternatives for java
update-alternatives: using /usr/lib/jvm/java-7-oracle/jre/bin/ControlPanel to provide
/usr/bin/ControlPanel (ControlPanel) in auto mode
update-alternatives: using /usr/lib/jvm/java-7-oracle/jre/bin/java to provide /usr/bin/java
(java) in auto mode
update-alternatives: using /usr/lib/jvm/java-7-oracle/jre/bin/java_vm to provide
/usr/bin/java_vm (java_vm) in auto mode
update-alternatives: using /usr/lib/jvm/java-7-oracle/jre/bin/javaws to provide /usr/bin/javaws
(javaws) in auto mode
update-alternatives: using /usr/lib/jvm/java-7-oracle/jre/bin/jcontrol to provide
/usr/bin/jcontrol (jcontrol) in auto mode
update-alternatives: using /usr/lib/jvm/java-7-oracle/jre/bin/keytool to provide
/usr/bin/keytool (keytool) in auto mode
update-alternatives: using /usr/lib/jvm/java-7-oracle/jre/bin/orbd to provide /usr/bin/orbd
(orbd) in auto mode
update-alternatives: using /usr/lib/jvm/java-7-oracle/jre/bin/pack200 to provide
/usr/bin/pack200 (pack200) in auto mode
update-alternatives: using /usr/lib/jvm/java-7-oracle/jre/bin/policytool to provide
/usr/bin/policytool (policytool) in auto mode
update-alternatives: using /usr/lib/jvm/java-7-oracle/jre/bin/rmid to provide /usr/bin/rmid
(rmid) in auto mode
update-alternatives: using /usr/lib/jvm/java-7-oracle/jre/bin/rmiregistry to provide
/usr/bin/rmiregistry (rmiregistry) in auto mode
update-alternatives: using /usr/lib/jvm/java-7-oracle/jre/bin/servertool to provide
/usr/bin/servertool (servertool) in auto mode
update-alternatives: using /usr/lib/jvm/java-7-oracle/jre/bin/tnameserv to provide
/usr/bin/tnameserv (tnameserv) in auto mode
update-alternatives: using /usr/lib/jvm/java-7-oracle/jre/bin/unpack200 to provide
/usr/bin/unpack200 (unpack200) in auto mode
update-alternatives: using /usr/lib/jvm/java-7-oracle/jre/lib/jexec to provide /usr/bin/jexec
(jexec) in auto mode
update-alternatives: using /usr/lib/jvm/java-7-oracle/bin/appletviewer to provide
/usr/bin/appletviewer (appletviewer) in auto mode
update-alternatives: using /usr/lib/jvm/java-7-oracle/bin/extcheck to provide /usr/bin/extcheck
(extcheck) in auto mode
update-alternatives: using /usr/lib/jvm/java-7-oracle/bin/idlj to provide /usr/bin/idlj
(idlj) in auto mode
update-alternatives: using /usr/lib/jvm/java-7-oracle/bin/jar to provide /usr/bin/jar
(jar) in auto mode
update-alternatives: using /usr/lib/jvm/java-7-oracle/bin/jarsigner to provide /usr/bin/jarsigner
(jarsigner) in auto mode
update-alternatives: using /usr/lib/jvm/java-7-oracle/bin/javac to provide /usr/bin/javac
(javac) in auto mode
update-alternatives: using /usr/lib/jvm/java-7-oracle/bin/javadoc to provide /usr/bin/javadoc
(javadoc) in auto mode
update-alternatives: using /usr/lib/jvm/java-7-oracle/bin/javafxpackager to provide
/usr/bin/javafxpackager (javafxpackager) in auto mode
update-alternatives: using /usr/lib/jvm/java-7-oracle/bin/javah to provide /usr/bin/javah
(javah) in auto mode
update-alternatives: using /usr/lib/jvm/java-7-oracle/bin/javap to provide /usr/bin/javap
(javap) in auto mode
update-alternatives: using /usr/lib/jvm/java-7-oracle/bin/jcmd to provide /usr/bin/jcmd
(jcmd) in auto mode
update-alternatives: using /usr/lib/jvm/java-7-oracle/bin/jconsole to provide /usr/bin/jconsole
(jconsole) in auto mode
update-alternatives: using /usr/lib/jvm/java-7-oracle/bin/jdb to provide /usr/bin/jdb
(jdb) in auto mode
update-alternatives: using /usr/lib/jvm/java-7-oracle/bin/jhat to provide /usr/bin/jhat
(jhat) in auto mode
update-alternatives: using /usr/lib/jvm/java-7-oracle/bin/jinfo to provide /usr/bin/jinfo
(jinfo) in auto mode
update-alternatives: using /usr/lib/jvm/java-7-oracle/bin/jmap to provide /usr/bin/jmap
(jmap) in auto mode
update-alternatives: using /usr/lib/jvm/java-7-oracle/bin/jmc to provide /usr/bin/jmc
(jmc) in auto mode
update-alternatives: using /usr/lib/jvm/java-7-oracle/bin/jps to provide /usr/bin/jps
(jps) in auto mode
update-alternatives: using /usr/lib/jvm/java-7-oracle/bin/jrunscript to provide /usr/bin/jrunscript
(jrunscript) in auto mode
update-alternatives: using /usr/lib/jvm/java-7-oracle/bin/jsadebugd to provide /usr/bin/jsadebugd
(jsadebugd) in auto mode
update-alternatives: using /usr/lib/jvm/java-7-oracle/bin/jstack to provide /usr/bin/jstack
(jstack) in auto mode
update-alternatives: using /usr/lib/jvm/java-7-oracle/bin/jstat to provide /usr/bin/jstat
(jstat) in auto mode
update-alternatives: using /usr/lib/jvm/java-7-oracle/bin/jstatd to provide /usr/bin/jstatd
(jstatd) in auto mode
update-alternatives: using /usr/lib/jvm/java-7-oracle/bin/jvisualvm to provide /usr/bin/jvisualvm
(jvisualvm) in auto mode
update-alternatives: using /usr/lib/jvm/java-7-oracle/bin/native2ascii to provide
/usr/bin/native2ascii (native2ascii) in auto mode
update-alternatives: using /usr/lib/jvm/java-7-oracle/bin/rmic to provide /usr/bin/rmic
(rmic) in auto mode
update-alternatives: using /usr/lib/jvm/java-7-oracle/bin/schemagen to provide /usr/bin/schemagen
(schemagen) in auto mode
update-alternatives: using /usr/lib/jvm/java-7-oracle/bin/serialver to provide /usr/bin/serialver
(serialver) in auto mode
update-alternatives: using /usr/lib/jvm/java-7-oracle/bin/wsgen to provide /usr/bin/wsgen
(wsgen) in auto mode
update-alternatives: using /usr/lib/jvm/java-7-oracle/bin/wsimport to provide /usr/bin/wsimport
(wsimport) in auto mode
update-alternatives: using /usr/lib/jvm/java-7-oracle/bin/xjc to provide /usr/bin/xjc
(xjc) in auto mode
Oracle JDK 7 installed
update-alternatives: using /usr/lib/jvm/java-7-oracle/jre/lib/amd64/libnpjp2.so to
provide /usr/lib/mozilla/plugins/libjavaplugin.so (mozilla-javaplugin.so) in auto mode
Oracle JRE 7 browser plugin installed
Setting up gsfonts (1:8.11+urwcyr1.0.7~pre44-4.2ubuntu1) ...
Setting up x11-common (1:7.7+1ubuntu8.1) ...
invoke-rc.d: policy-rc.d denied execution of start.
Setting up oracle-java7-set-default (7u80+7u60arm-0~webupd8~1) ...
Processing triggers for ureadahead (0.100.0-16) ...
Setting up xfonts-encodings (1:1.0.4-1ubuntu1) ...
Setting up xfonts-utils (1:7.7+1) ...
Setting up gsfonts-x11 (0.22) ...
Processing triggers for libc-bin (2.19-0ubuntu6.6) ...
 ---> 81b300907921
Removing intermediate container d5c240379373
Step 8 : RUN curl -sSL http://archive.apache.org/dist/maven/maven-3/3.0.4/binaries/apache-maven-3.0.4-bin.tar.gz
| tar -C /usr/share -xz &&     mv /usr/share/apache-maven-3.0.4 /usr/share/maven &&
    ln -s /usr/share/maven/bin/mvn /usr/bin/mvn
 ---> Running in 70df18b5b418
 ---> 17ccf2527bd3
Removing intermediate container 70df18b5b418
Step 9 : RUN curl -sSL http://archive.apache.org/dist/ant/binaries/apache-ant-1.9.6-bin.tar.gz
| tar -C /usr/share -xz &&     mv /usr/share/apache-ant-1.9.6 /usr/share/ant &&
    ln -s /usr/share/ant/bin/ant /usr/bin/ant
 ---> Running in b25ce2e2df00
 ---> ff5b53c4747c
Removing intermediate container b25ce2e2df00
Step 10 : ENV JAVA_HOME /usr/lib/jvm/java-7-oracle
 ---> Running in ac12c05d9d79
 ---> d618a6b1f651
Removing intermediate container ac12c05d9d79
Step 11 : ENV MAVEN_HOME /usr/share/maven
 ---> Running in 9ea1d0d935cd
 ---> a05365d2bdf5
Removing intermediate container 9ea1d0d935cd
Step 12 : ENV ANT_HOME /ust/share/ant
 ---> Running in 6f903d22e4ce
 ---> 19124b1d84cb
Removing intermediate container 6f903d22e4ce
Step 13 : RUN curl -sSL https://storage.googleapis.com/golang/go1.5.1.linux-amd64.tar.gz |
tar -C /usr/lib/ -xz &&     mkdir -p /usr/share/go
 ---> Running in cc69cbfe8ab8
 ---> 329d2a6c3c7a
Removing intermediate container cc69cbfe8ab8
Step 14 : ENV GOROOT /usr/lib/go
 ---> Running in 001c0bd3da71
 ---> ab2796290ad4
Removing intermediate container 001c0bd3da71
Step 15 : ENV GOPATH /usr/share/go
 ---> Running in 2099ec7a6cf6
 ---> 8ecfea31df26
Removing intermediate container 2099ec7a6cf6
Step 16 : ENV PATH ${GOROOT}/bin:${GOPATH}/bin:$PATH
 ---> Running in 3dd5831c42ea
 ---> 2578fcd265f2
Removing intermediate container 3dd5831c42ea
Step 17 : RUN apt-get clean &&     rm -rf /var/cache/apt/* &&     rm -rf /var/lib/apt/lists/*
&&     rm -rf /tmp/* &&     rm -rf /var/tmp/*
 ---> Running in f1f0379645e3
 ---> 2fcac1e49dd5
Removing intermediate container f1f0379645e3
Step 18 : WORKDIR $HOME
 ---> Running in f2e0c97d86bb
 ---> 35e1c5bf5e47
Removing intermediate container f2e0c97d86bb
Successfully built 35e1c5bf5e47
++ pwd
+ docker run -v <https://builds.apache.org/job/HTrace-Master/ws/>:/htrace --entrypoint
/bin/bash htrace -c 'cd /htrace && mvn clean && mvn install site'
[INFO] Scanning for projects...
Downloading: http://repo.maven.apache.org/maven2/org/apache/apache/17/apache-17.pom
2/16 KB   
6/16 KB   
10/16 KB   
13/16 KB   
16/16 KB   
           
Downloaded: http://repo.maven.apache.org/maven2/org/apache/apache/17/apache-17.pom (16 KB
at 64.0 KB/sec)
[ERROR] The build could not read 1 project -> [Help 1]
[ERROR]   
[ERROR]   The project org.apache.htrace:htrace:4.1.0-incubating-SNAPSHOT (/htrace/pom.xml)
has 1 error
[ERROR]     Child module /htrace/htrace-core4 of /htrace/pom.xml does not exist
[ERROR] 
[ERROR] To see the full stack trace of the errors, re-run Maven with the -e switch.
[ERROR] Re-run Maven using the -X switch to enable full debug logging.
[ERROR] 
[ERROR] For more information about the errors and possible solutions, please read the following
articles:
[ERROR] [Help 1] http://cwiki.apache.org/confluence/display/MAVEN/ProjectBuildingException
Build step 'Execute shell' marked build as failure
[FINDBUGS] Skipping publisher since build result is FAILURE
Performing Post build task...
Match found for :.* : True
Logical operation result is TRUE
Running script  : 
[HTrace-Master] $ /bin/bash -xe /tmp/hudson6105110649899299541.sh
POST BUILD TASK : SUCCESS
END OF POST BUILD TASK : 0
Archiving artifacts
Sending artifact delta relative to HTrace-Master #117
Archived 49 artifacts
Archive block size is 32768
Received 0 blocks and 741699 bytes
Compression is 0.0%
Took 0.51 sec
Recording test results
Updating HTRACE-256

Mime
View raw message