hive-user mailing list archives

Site index · List index
Message view « Date » · « Thread »
Top « Date » · « Thread »
From Niranjan Sarvi <nsa...@gmail.com>
Subject Maven build error while building hive 0.14
Date Wed, 22 Oct 2014 03:18:52 GMT
Hello,

I needed to use 'org.apache.hadoop.hive.contrib.serde2.MultiDelimitSerDe'
as this is only available from the 0.14 onwords. I though to get the source
and compile hive 0.14. I installed the cygwin on my windows laptop so that
bash program can work and maven can run the bash as well. So, after getting
source and run the maven for the package, I get the below error, any help
would be really appreciated.


[INFO]
------------------------------------------------------------------------
[INFO] Reactor Summary:
[INFO]
[INFO] Hive .............................................. SUCCESS [  3.906
s]
[INFO] Hive Shims Common ................................. SUCCESS [  2.141
s]
[INFO] Hive Shims 0.20 ................................... SUCCESS [  1.062
s]
[INFO] Hive Shims Secure Common .......................... SUCCESS [  1.516
s]
[INFO] Hive Shims 0.20S .................................. SUCCESS [  1.203
s]
[INFO] Hive Shims 0.23 ................................... SUCCESS [  5.547
s]
[INFO] Hive Shims ........................................ SUCCESS [  0.594
s]
[INFO] Hive Common ....................................... FAILURE [  1.000
s]
[INFO] Hive Serde ........................................ SKIPPED
[INFO] Hive Metastore .................................... SKIPPED
[INFO] Hive Ant Utilities ................................ SKIPPED
[INFO] Hive Query Language ............................... SKIPPED
[INFO] Hive Service ...................................... SKIPPED
[INFO] Hive Accumulo Handler ............................. SKIPPED
[INFO] Hive JDBC ......................................... SKIPPED
[INFO] Hive Beeline ...................................... SKIPPED
[INFO] Hive CLI .......................................... SKIPPED
[INFO] Hive Contrib ...................................... SKIPPED
[INFO] Hive HBase Handler ................................ SKIPPED
[INFO] Hive HCatalog ..................................... SKIPPED
[INFO] Hive HCatalog Core ................................ SKIPPED
[INFO] Hive HCatalog Pig Adapter ......................... SKIPPED
[INFO] Hive HCatalog Server Extensions ................... SKIPPED
[INFO] Hive HCatalog Webhcat Java Client ................. SKIPPED
[INFO] Hive HCatalog Webhcat ............................. SKIPPED
[INFO] Hive HCatalog Streaming ........................... SKIPPED
[INFO] Hive HWI .......................................... SKIPPED
[INFO] Hive ODBC ......................................... SKIPPED
[INFO] Hive Shims Aggregator ............................. SKIPPED
[INFO] Hive TestUtils .................................... SKIPPED
[INFO] Hive Packaging .................................... SKIPPED
[INFO]
------------------------------------------------------------------------
[INFO] BUILD FAILURE
[INFO]
------------------------------------------------------------------------
[INFO] Total time: 18.610 s
[INFO] Finished at: 2014-10-21T22:04:03-06:00
[INFO] Final Memory: 25M/63M
[INFO]
------------------------------------------------------------------------
[ERROR] Failed to execute goal
org.apache.maven.plugins:maven-antrun-plugin:1.7:run
(generate-version-annotation) on project hive-common: An Ant BuildException
has occured: exec returned: 2
[ERROR] around Ant part ...<exec executable="bash" failonerror="true">... @
4:46 in C:\Documents and
Settings\e6wl2he\hadoop\branch-0.14\common\target\antrun\build-main.xml
[ERROR] -> [Help 1]
org.apache.maven.lifecycle.LifecycleExecutionException: Failed to execute
goal org.apache.maven.plugins:maven-antrun-plugin:1.7:run
(generate-version-annotation) on project hive-common: An Ant BuildException
has occured: exec returned: 2
around Ant part ...<exec executable="bash" failonerror="true">... @ 4:46 in
C:\Documents and
Settings\e6wl2he\hadoop\branch-0.14\common\target\antrun\build-main.xml
at
org.apache.maven.lifecycle.internal.MojoExecutor.execute(MojoExecutor.java:216)
at
org.apache.maven.lifecycle.internal.MojoExecutor.execute(MojoExecutor.java:153)
at
org.apache.maven.lifecycle.internal.MojoExecutor.execute(MojoExecutor.java:145)
at
org.apache.maven.lifecycle.internal.LifecycleModuleBuilder.buildProject(LifecycleModuleBuilder.java:108)
at
org.apache.maven.lifecycle.internal.LifecycleModuleBuilder.buildProject(LifecycleModuleBuilder.java:76)
at
org.apache.maven.lifecycle.internal.builder.singlethreaded.SingleThreadedBuilder.build(SingleThreadedBuilder.java:51)
at
org.apache.maven.lifecycle.internal.LifecycleStarter.execute(LifecycleStarter.java:116)
at org.apache.maven.DefaultMaven.doExecute(DefaultMaven.java:361)
at org.apache.maven.DefaultMaven.execute(DefaultMaven.java:155)
at org.apache.maven.cli.MavenCli.execute(MavenCli.java:584)
at org.apache.maven.cli.MavenCli.doMain(MavenCli.java:213)
at org.apache.maven.cli.MavenCli.main(MavenCli.java:157)
at sun.reflect.NativeMethodAccessorImpl.invoke0(Native Method)
at
sun.reflect.NativeMethodAccessorImpl.invoke(NativeMethodAccessorImpl.java:39)
at
sun.reflect.DelegatingMethodAccessorImpl.invoke(DelegatingMethodAccessorImpl.java:25)
at java.lang.reflect.Method.invoke(Method.java:597)
at
org.codehaus.plexus.classworlds.launcher.Launcher.launchEnhanced(Launcher.java:289)
at
org.codehaus.plexus.classworlds.launcher.Launcher.launch(Launcher.java:229)
at
org.codehaus.plexus.classworlds.launcher.Launcher.mainWithExitCode(Launcher.java:415)
at org.codehaus.plexus.classworlds.launcher.Launcher.main(Launcher.java:356)
Caused by: org.apache.maven.plugin.MojoExecutionException: An Ant
BuildException has occured: exec returned: 2
around Ant part ...<exec executable="bash" failonerror="true">... @ 4:46 in
C:\Documents and
Settings\e6wl2he\hadoop\branch-0.14\common\target\antrun\build-main.xml
at org.apache.maven.plugin.antrun.AntRunMojo.execute(AntRunMojo.java:355)
at
org.apache.maven.plugin.DefaultBuildPluginManager.executeMojo(DefaultBuildPluginManager.java:133)
at
org.apache.maven.lifecycle.internal.MojoExecutor.execute(MojoExecutor.java:208)
... 19 more
Caused by: C:\Documents and
Settings\e6wl2he\hadoop\branch-0.14\common\target\antrun\build-main.xml:4:
exec returned: 2
at org.apache.tools.ant.taskdefs.ExecTask.runExecute(ExecTask.java:646)
at org.apache.tools.ant.taskdefs.ExecTask.runExec(ExecTask.java:672)
at org.apache.tools.ant.taskdefs.ExecTask.execute(ExecTask.java:498)
at org.apache.tools.ant.UnknownElement.execute(UnknownElement.java:291)
at sun.reflect.GeneratedMethodAccessor29.invoke(Unknown Source)
at
sun.reflect.DelegatingMethodAccessorImpl.invoke(DelegatingMethodAccessorImpl.java:25)
at java.lang.reflect.Method.invoke(Method.java:597)
at
org.apache.tools.ant.dispatch.DispatchUtils.execute(DispatchUtils.java:106)
at org.apache.tools.ant.Task.perform(Task.java:348)
at org.apache.tools.ant.Target.execute(Target.java:390)
at org.apache.tools.ant.Target.performTasks(Target.java:411)
at org.apache.tools.ant.Project.executeSortedTargets(Project.java:1399)
at org.apache.tools.ant.Project.executeTarget(Project.java:1368)
at org.apache.maven.plugin.antrun.AntRunMojo.execute(AntRunMojo.java:327)
... 21 more
[ERROR]
[ERROR]
[ERROR] For more information about the errors and possible solutions,
please read the following articles:
[ERROR] [Help 1]
http://cwiki.apache.org/confluence/display/MAVEN/MojoExecutionException
[ERROR]
[ERROR] After correcting the problems, you can resume the build with the
command
[ERROR]   mvn <goals> -rf :hive-common

Mime
View raw message