hive-issues mailing list archives

Site index · List index
Message view « Date » · « Thread »
Top « Date » · « Thread »
From "Zoltan Haindrich (Jira)" <j...@apache.org>
Subject [jira] [Commented] (HIVE-23524) TestNewGetSplitsFormat is unstable
Date Wed, 17 Jun 2020 07:36:00 GMT

    [ https://issues.apache.org/jira/browse/HIVE-23524?page=com.atlassian.jira.plugin.system.issuetabpanels:comment-tabpanel&focusedCommentId=17138183#comment-17138183
] 

Zoltan Haindrich commented on HIVE-23524:
-----------------------------------------

more flaky stuff from the returnpath stuff...disabling whole testclass
http://34.66.156.144:8080/job/hive-precommit/job/master/49/testReport/

> TestNewGetSplitsFormat is unstable
> ----------------------------------
>
>                 Key: HIVE-23524
>                 URL: https://issues.apache.org/jira/browse/HIVE-23524
>             Project: Hive
>          Issue Type: Sub-task
>            Reporter: Zoltan Haindrich
>            Priority: Major
>
> http://34.66.156.144:8080/job/hive-c/5/console
> {code}
> 12:05:16  [INFO] -------------------------------------------------------
> 12:05:16  [INFO]  T E S T S
> 12:05:16  [INFO] -------------------------------------------------------
> 12:05:16  [INFO] Running org.apache.hive.jdbc.TestNewGetSplitsFormat
> 12:12:38  [ERROR] Tests run: 9, Failures: 0, Errors: 2, Skipped: 0, Time elapsed: 433.083
s <<< FAILURE! - in org.apache.hive.jdbc.TestNewGetSplitsFormat
> 12:12:38  [ERROR] testLlapInputFormatEndToEnd(org.apache.hive.jdbc.TestNewGetSplitsFormat)
 Time elapsed: 82.662 s  <<< ERROR!
> 12:12:38  java.io.IOException: java.sql.SQLException: Error while cleaning up the server
resources
> 12:12:38  	at org.apache.hadoop.hive.llap.LlapBaseInputFormat.getSplits(LlapBaseInputFormat.java:350)
> 12:12:38  	at org.apache.hadoop.hive.llap.LlapArrowRowInputFormat.getSplits(LlapArrowRowInputFormat.java:54)
> 12:12:38  	at org.apache.hive.jdbc.TestNewGetSplitsFormat.processQuery(TestNewGetSplitsFormat.java:87)
> 12:12:38  	at org.apache.hive.jdbc.BaseJdbcWithMiniLlap.processQuery(BaseJdbcWithMiniLlap.java:676)
> 12:12:38  	at org.apache.hive.jdbc.BaseJdbcWithMiniLlap.testLlapInputFormatEndToEnd(BaseJdbcWithMiniLlap.java:223)
> 12:12:38  	at sun.reflect.NativeMethodAccessorImpl.invoke0(Native Method)
> 12:12:38  	at sun.reflect.NativeMethodAccessorImpl.invoke(NativeMethodAccessorImpl.java:62)
> 12:12:38  	at sun.reflect.DelegatingMethodAccessorImpl.invoke(DelegatingMethodAccessorImpl.java:43)
> 12:12:38  	at java.lang.reflect.Method.invoke(Method.java:498)
> 12:12:38  	at org.junit.runners.model.FrameworkMethod$1.runReflectiveCall(FrameworkMethod.java:47)
> 12:12:38  	at org.junit.internal.runners.model.ReflectiveCallable.run(ReflectiveCallable.java:12)
> 12:12:38  	at org.junit.runners.model.FrameworkMethod.invokeExplosively(FrameworkMethod.java:44)
> 12:12:38  	at org.junit.internal.runners.statements.InvokeMethod.evaluate(InvokeMethod.java:17)
> 12:12:38  	at org.junit.internal.runners.statements.FailOnTimeout$StatementThread.run(FailOnTimeout.java:74)
> 12:12:38  Caused by: java.sql.SQLException: Error while cleaning up the server resources
> 12:12:38  	at org.apache.hive.jdbc.HiveConnection.close(HiveConnection.java:1018)
> 12:12:38  	at org.apache.hadoop.hive.llap.LlapBaseInputFormat.getSplits(LlapBaseInputFormat.java:342)
> 12:12:38  	... 13 more
> 12:12:38  Caused by: org.apache.thrift.transport.TTransportException: java.net.SocketTimeoutException:
Read timed out
> 12:12:38  	at org.apache.thrift.transport.TIOStreamTransport.read(TIOStreamTransport.java:129)
> 12:12:38  	at org.apache.thrift.transport.TTransport.readAll(TTransport.java:86)
> 12:12:38  	at org.apache.thrift.transport.TSaslTransport.readLength(TSaslTransport.java:374)
> 12:12:38  	at org.apache.thrift.transport.TSaslTransport.readFrame(TSaslTransport.java:451)
> 12:12:38  	at org.apache.thrift.transport.TSaslTransport.read(TSaslTransport.java:433)
> 12:12:38  	at org.apache.thrift.transport.TSaslClientTransport.read(TSaslClientTransport.java:37)
> 12:12:38  	at org.apache.thrift.transport.TTransport.readAll(TTransport.java:86)
> 12:12:38  	at org.apache.thrift.protocol.TBinaryProtocol.readStringBody(TBinaryProtocol.java:380)
> 12:12:38  	at org.apache.thrift.protocol.TBinaryProtocol.readMessageBegin(TBinaryProtocol.java:230)
> 12:12:38  	at org.apache.thrift.TServiceClient.receiveBase(TServiceClient.java:77)
> 12:12:38  	at org.apache.hive.service.rpc.thrift.TCLIService$Client.recv_CloseSession(TCLIService.java:199)
> 12:12:38  	at org.apache.hive.service.rpc.thrift.TCLIService$Client.CloseSession(TCLIService.java:186)
> 12:12:38  	at sun.reflect.NativeMethodAccessorImpl.invoke0(Native Method)
> 12:12:38  	at sun.reflect.NativeMethodAccessorImpl.invoke(NativeMethodAccessorImpl.java:62)
> 12:12:38  	at sun.reflect.DelegatingMethodAccessorImpl.invoke(DelegatingMethodAccessorImpl.java:43)
> 12:12:38  	at java.lang.reflect.Method.invoke(Method.java:498)
> 12:12:38  	at org.apache.hive.jdbc.HiveConnection$SynchronizedHandler.invoke(HiveConnection.java:1732)
> 12:12:38  	at com.sun.proxy.$Proxy139.CloseSession(Unknown Source)
> 12:12:38  	at org.apache.hive.jdbc.HiveConnection.close(HiveConnection.java:1016)
> 12:12:38  	... 14 more
> 12:12:38  Caused by: java.net.SocketTimeoutException: Read timed out
> 12:12:38  	at java.net.SocketInputStream.socketRead0(Native Method)
> 12:12:38  	at java.net.SocketInputStream.socketRead(SocketInputStream.java:116)
> 12:12:38  	at java.net.SocketInputStream.read(SocketInputStream.java:171)
> 12:12:38  	at java.net.SocketInputStream.read(SocketInputStream.java:141)
> 12:12:38  	at java.io.BufferedInputStream.fill(BufferedInputStream.java:246)
> 12:12:38  	at java.io.BufferedInputStream.read1(BufferedInputStream.java:286)
> 12:12:38  	at java.io.BufferedInputStream.read(BufferedInputStream.java:345)
> 12:12:38  	at org.apache.thrift.transport.TIOStreamTransport.read(TIOStreamTransport.java:127)
> 12:12:38  	... 32 more
> 12:12:38  
> 12:12:38  [ERROR] testComplexQuery(org.apache.hive.jdbc.TestNewGetSplitsFormat)  Time
elapsed: 60.045 s  <<< ERROR!
> 12:12:38  java.lang.Exception: test timed out after 60000 milliseconds
> 12:12:38  	at java.net.SocketInputStream.socketRead0(Native Method)
> 12:12:38  	at java.net.SocketInputStream.socketRead(SocketInputStream.java:116)
> 12:12:38  	at java.net.SocketInputStream.read(SocketInputStream.java:171)
> 12:12:38  	at java.net.SocketInputStream.read(SocketInputStream.java:141)
> 12:12:38  	at java.io.BufferedInputStream.fill(BufferedInputStream.java:246)
> 12:12:38  	at java.io.BufferedInputStream.read1(BufferedInputStream.java:286)
> 12:12:38  	at java.io.BufferedInputStream.read(BufferedInputStream.java:345)
> 12:12:38  	at org.apache.thrift.transport.TIOStreamTransport.read(TIOStreamTransport.java:127)
> 12:12:38  	at org.apache.thrift.transport.TTransport.readAll(TTransport.java:86)
> 12:12:38  	at org.apache.thrift.transport.TSaslTransport.readLength(TSaslTransport.java:374)
> 12:12:38  	at org.apache.thrift.transport.TSaslTransport.readFrame(TSaslTransport.java:451)
> 12:12:38  	at org.apache.thrift.transport.TSaslTransport.read(TSaslTransport.java:433)
> 12:12:38  	at org.apache.thrift.transport.TSaslClientTransport.read(TSaslClientTransport.java:37)
> 12:12:38  	at org.apache.thrift.transport.TTransport.readAll(TTransport.java:86)
> 12:12:38  	at org.apache.thrift.protocol.TBinaryProtocol.readStringBody(TBinaryProtocol.java:380)
> 12:12:38  	at org.apache.thrift.protocol.TBinaryProtocol.readMessageBegin(TBinaryProtocol.java:230)
> 12:12:38  	at org.apache.thrift.TServiceClient.receiveBase(TServiceClient.java:77)
> 12:12:38  	at org.apache.hive.service.rpc.thrift.TCLIService$Client.recv_CloseSession(TCLIService.java:199)
> 12:12:38  	at org.apache.hive.service.rpc.thrift.TCLIService$Client.CloseSession(TCLIService.java:186)
> 12:12:38  	at sun.reflect.NativeMethodAccessorImpl.invoke0(Native Method)
> 12:12:38  	at sun.reflect.NativeMethodAccessorImpl.invoke(NativeMethodAccessorImpl.java:62)
> 12:12:38  	at sun.reflect.DelegatingMethodAccessorImpl.invoke(DelegatingMethodAccessorImpl.java:43)
> 12:12:38  	at java.lang.reflect.Method.invoke(Method.java:498)
> 12:12:38  	at org.apache.hive.jdbc.HiveConnection$SynchronizedHandler.invoke(HiveConnection.java:1732)
> 12:12:38  	at com.sun.proxy.$Proxy139.CloseSession(Unknown Source)
> 12:12:38  	at org.apache.hive.jdbc.HiveConnection.close(HiveConnection.java:1016)
> 12:12:38  	at org.apache.hadoop.hive.llap.LlapBaseInputFormat.getSplits(LlapBaseInputFormat.java:342)
> 12:12:38  	at org.apache.hadoop.hive.llap.LlapArrowRowInputFormat.getSplits(LlapArrowRowInputFormat.java:54)
> 12:12:38  	at org.apache.hive.jdbc.TestNewGetSplitsFormat.processQuery(TestNewGetSplitsFormat.java:87)
> 12:12:38  	at org.apache.hive.jdbc.BaseJdbcWithMiniLlap.processQuery(BaseJdbcWithMiniLlap.java:676)
> 12:12:38  	at org.apache.hive.jdbc.BaseJdbcWithMiniLlap.testComplexQuery(BaseJdbcWithMiniLlap.java:625)
> 12:12:38  	at sun.reflect.NativeMethodAccessorImpl.invoke0(Native Method)
> 12:12:38  	at sun.reflect.NativeMethodAccessorImpl.invoke(NativeMethodAccessorImpl.java:62)
> 12:12:38  	at sun.reflect.DelegatingMethodAccessorImpl.invoke(DelegatingMethodAccessorImpl.java:43)
> 12:12:38  	at java.lang.reflect.Method.invoke(Method.java:498)
> 12:12:38  	at org.junit.runners.model.FrameworkMethod$1.runReflectiveCall(FrameworkMethod.java:47)
> 12:12:38  	at org.junit.internal.runners.model.ReflectiveCallable.run(ReflectiveCallable.java:12)
> 12:12:38  	at org.junit.runners.model.FrameworkMethod.invokeExplosively(FrameworkMethod.java:44)
> 12:12:38  	at org.junit.internal.runners.statements.InvokeMethod.evaluate(InvokeMethod.java:17)
> 12:12:38  	at org.junit.internal.runners.statements.FailOnTimeout$StatementThread.run(FailOnTimeout.java:74)
> 12:12:38  
> 12:12:38  [INFO] 
> 12:12:38  [INFO] Results:
> 12:12:38  [INFO] 
> 12:12:38  [ERROR] Errors: 
> 12:12:38  [ERROR]   TestNewGetSplitsFormat>BaseJdbcWithMiniLlap.testComplexQuery:625->BaseJdbcWithMiniLlap.processQuery:676->processQuery:87
» 
> 12:12:38  [ERROR]   TestNewGetSplitsFormat>BaseJdbcWithMiniLlap.testLlapInputFormatEndToEnd:223->BaseJdbcWithMiniLlap.processQuery:676->processQuery:87
» IO
> 12:12:38  [INFO] 
> 12:12:38  [ERROR] Tests run: 9, Failures: 0, Errors: 2, Skipped: 0
> 12:12:38  [INFO] 
> 12:12:38  [ERROR] Failed to execute goal org.apache.maven.plugins:maven-surefire-plugin:2.21.0:test
(default-test) on project hive-it-unit: There are test failures.
> 12:12:38  [ERROR] 
> 12:12:38  [ERROR] Please refer to /home/jenkins/agent/workspace/hive-c/itests/hive-unit/target/surefire-reports
for the individual test results.
> 12:12:38  [ERROR] Please refer to dump files (if any exist) [date]-jvmRun[N].dump, [date].dumpstream
and [date]-jvmRun[N].dumpstream.
> 12:12:38  [ERROR] -> [Help 1]
> 12:12:38  [ERROR] 
> 12:12:38  [ERROR] To see the full stack trace of the errors, re-run Maven with the -e
switch.
> 12:12:38  [ERROR] Re-run Maven using the -X switch to enable full debug logging.
> 12:12:38  [ERROR] 
> 12:12:38  [ERROR] For more information about the errors and possible solutions, please
read the following articles:
> 12:12:38  [ERROR] [Help 1] http://cwiki.apache.org/confluence/display/MAVEN/MojoFailureException
> {code}



--
This message was sent by Atlassian Jira
(v8.3.4#803005)

Mime
View raw message