hive-issues mailing list archives

Site index · List index
Message view « Date » · « Thread »
Top « Date » · « Thread »
From "Hive QA (JIRA)" <j...@apache.org>
Subject [jira] [Commented] (HIVE-21639) Spark test failed since HIVE-10632
Date Sun, 21 Apr 2019 17:16:00 GMT

    [ https://issues.apache.org/jira/browse/HIVE-21639?page=com.atlassian.jira.plugin.system.issuetabpanels:comment-tabpanel&focusedCommentId=16822733#comment-16822733
] 

Hive QA commented on HIVE-21639:
--------------------------------



Here are the results of testing the latest attachment:
https://issues.apache.org/jira/secure/attachment/12966586/HIVE-21639.branch-2.patch

{color:red}ERROR:{color} -1 due to build exiting with an error

Test results: https://builds.apache.org/job/PreCommit-HIVE-Build/17002/testReport
Console output: https://builds.apache.org/job/PreCommit-HIVE-Build/17002/console
Test logs: http://104.198.109.242/logs/PreCommit-HIVE-Build-17002/

Messages:
{noformat}
Executing org.apache.hive.ptest.execution.TestCheckPhase
Executing org.apache.hive.ptest.execution.PrepPhase
Tests exited with: NonZeroExitCodeException
Command 'bash /data/hiveptest/working/scratch/source-prep.sh' failed with exit status 1 and
output '+ date '+%Y-%m-%d %T.%3N'
2019-04-21 17:10:58.362
+ [[ -n /usr/lib/jvm/java-8-openjdk-amd64 ]]
+ export JAVA_HOME=/usr/lib/jvm/java-8-openjdk-amd64
+ JAVA_HOME=/usr/lib/jvm/java-8-openjdk-amd64
+ export PATH=/usr/lib/jvm/java-8-openjdk-amd64/bin/:/usr/local/bin:/usr/bin:/bin:/usr/local/games:/usr/games
+ PATH=/usr/lib/jvm/java-8-openjdk-amd64/bin/:/usr/local/bin:/usr/bin:/bin:/usr/local/games:/usr/games
+ export 'ANT_OPTS=-Xmx1g -XX:MaxPermSize=256m '
+ ANT_OPTS='-Xmx1g -XX:MaxPermSize=256m '
+ export 'MAVEN_OPTS=-Xmx1g '
+ MAVEN_OPTS='-Xmx1g '
+ cd /data/hiveptest/working/
+ tee /data/hiveptest/logs/PreCommit-HIVE-Build-17002/source-prep.txt
+ [[ false == \t\r\u\e ]]
+ mkdir -p maven ivy
+ [[ git = \s\v\n ]]
+ [[ git = \g\i\t ]]
+ [[ -z branch-2 ]]
+ [[ -d apache-github-branch-2-source ]]
+ [[ ! -d apache-github-branch-2-source/.git ]]
+ [[ ! -d apache-github-branch-2-source ]]
+ date '+%Y-%m-%d %T.%3N'
2019-04-21 17:10:58.448
+ cd apache-github-branch-2-source
+ git fetch origin
>From https://github.com/apache/hive
   0b8cfa7..fd2f7c8  branch-2   -> origin/branch-2
   3b1d4fd..dc40659  branch-2.3 -> origin/branch-2.3
   c791b90..87570b9  branch-3   -> origin/branch-3
   5909c6e..a354bed  branch-3.0 -> origin/branch-3.0
   008eda8..8290316  branch-3.1 -> origin/branch-3.1
   fd2be8e..b58d50c  master     -> origin/master
 * [new tag]         rel/release-2.3.4 -> rel/release-2.3.4
+ git reset --hard HEAD
HEAD is now at 0b8cfa7 HIVE-21040 : msck does unnecessary file listing at last level of directory
tree (Vihang Karajgaonkar, reviewed by Prasanth Jayachandran)
+ git clean -f -d
+ git checkout branch-2
Already on 'branch-2'
Your branch is behind 'origin/branch-2' by 2 commits, and can be fast-forwarded.
  (use "git pull" to update your local branch)
+ git reset --hard origin/branch-2
HEAD is now at fd2f7c8 HIVE-21484 : Metastore API getVersion() should return real version
(Vihang Karajgaonkar, reviewed by Naveen Gangam and Peter Vary)
+ git merge --ff-only origin/branch-2
Already up-to-date.
+ date '+%Y-%m-%d %T.%3N'
2019-04-21 17:11:21.030
+ rm -rf ../yetus_PreCommit-HIVE-Build-17002
+ mkdir ../yetus_PreCommit-HIVE-Build-17002
+ git gc
+ cp -R . ../yetus_PreCommit-HIVE-Build-17002
+ mkdir /data/hiveptest/logs/PreCommit-HIVE-Build-17002/yetus
+ patchCommandPath=/data/hiveptest/working/scratch/smart-apply-patch.sh
+ patchFilePath=/data/hiveptest/working/scratch/build.patch
+ [[ -f /data/hiveptest/working/scratch/build.patch ]]
+ chmod +x /data/hiveptest/working/scratch/smart-apply-patch.sh
+ /data/hiveptest/working/scratch/smart-apply-patch.sh /data/hiveptest/working/scratch/build.patch
Going to apply patch with: git apply -p0
+ [[ maven == \m\a\v\e\n ]]
+ rm -rf /data/hiveptest/working/maven/org/apache/hive
+ mvn -B clean install -DskipTests -T 4 -q -Dmaven.repo.local=/data/hiveptest/working/maven
ANTLR Parser Generator  Version 3.5.2
Output file /data/hiveptest/working/apache-github-branch-2-source/metastore/target/generated-sources/antlr3/org/apache/hadoop/hive/metastore/parser/FilterParser.java
does not exist: must build /data/hiveptest/working/apache-github-branch-2-source/metastore/src/java/org/apache/hadoop/hive/metastore/parser/Filter.g
org/apache/hadoop/hive/metastore/parser/Filter.g
DataNucleus Enhancer (version 4.1.17) for API "JDO"
DataNucleus Enhancer : Classpath
>>  /usr/share/maven/boot/plexus-classworlds-2.x.jar
ENHANCED (Persistable) : org.apache.hadoop.hive.metastore.model.MDatabase
ENHANCED (Persistable) : org.apache.hadoop.hive.metastore.model.MFieldSchema
ENHANCED (Persistable) : org.apache.hadoop.hive.metastore.model.MType
ENHANCED (Persistable) : org.apache.hadoop.hive.metastore.model.MTable
ENHANCED (Persistable) : org.apache.hadoop.hive.metastore.model.MConstraint
ENHANCED (Persistable) : org.apache.hadoop.hive.metastore.model.MSerDeInfo
ENHANCED (Persistable) : org.apache.hadoop.hive.metastore.model.MOrder
ENHANCED (Persistable) : org.apache.hadoop.hive.metastore.model.MColumnDescriptor
ENHANCED (Persistable) : org.apache.hadoop.hive.metastore.model.MStringList
ENHANCED (Persistable) : org.apache.hadoop.hive.metastore.model.MStorageDescriptor
ENHANCED (Persistable) : org.apache.hadoop.hive.metastore.model.MPartition
ENHANCED (Persistable) : org.apache.hadoop.hive.metastore.model.MIndex
ENHANCED (Persistable) : org.apache.hadoop.hive.metastore.model.MRole
ENHANCED (Persistable) : org.apache.hadoop.hive.metastore.model.MRoleMap
ENHANCED (Persistable) : org.apache.hadoop.hive.metastore.model.MGlobalPrivilege
ENHANCED (Persistable) : org.apache.hadoop.hive.metastore.model.MDBPrivilege
ENHANCED (Persistable) : org.apache.hadoop.hive.metastore.model.MTablePrivilege
ENHANCED (Persistable) : org.apache.hadoop.hive.metastore.model.MPartitionPrivilege
ENHANCED (Persistable) : org.apache.hadoop.hive.metastore.model.MTableColumnPrivilege
ENHANCED (Persistable) : org.apache.hadoop.hive.metastore.model.MPartitionColumnPrivilege
ENHANCED (Persistable) : org.apache.hadoop.hive.metastore.model.MPartitionEvent
ENHANCED (Persistable) : org.apache.hadoop.hive.metastore.model.MMasterKey
ENHANCED (Persistable) : org.apache.hadoop.hive.metastore.model.MDelegationToken
ENHANCED (Persistable) : org.apache.hadoop.hive.metastore.model.MTableColumnStatistics
ENHANCED (Persistable) : org.apache.hadoop.hive.metastore.model.MPartitionColumnStatistics
ENHANCED (Persistable) : org.apache.hadoop.hive.metastore.model.MVersionTable
ENHANCED (Persistable) : org.apache.hadoop.hive.metastore.model.MResourceUri
ENHANCED (Persistable) : org.apache.hadoop.hive.metastore.model.MFunction
ENHANCED (Persistable) : org.apache.hadoop.hive.metastore.model.MNotificationLog
ENHANCED (Persistable) : org.apache.hadoop.hive.metastore.model.MNotificationNextId
DataNucleus Enhancer completed with success for 30 classes. Timings : input=158 ms, enhance=218
ms, total=376 ms. Consult the log for full details
ANTLR Parser Generator  Version 3.5.2
Output file /data/hiveptest/working/apache-github-branch-2-source/ql/target/generated-sources/antlr3/org/apache/hadoop/hive/ql/parse/HiveLexer.java
does not exist: must build /data/hiveptest/working/apache-github-branch-2-source/ql/src/java/org/apache/hadoop/hive/ql/parse/HiveLexer.g
org/apache/hadoop/hive/ql/parse/HiveLexer.g
Output file /data/hiveptest/working/apache-github-branch-2-source/ql/target/generated-sources/antlr3/org/apache/hadoop/hive/ql/parse/HiveParser.java
does not exist: must build /data/hiveptest/working/apache-github-branch-2-source/ql/src/java/org/apache/hadoop/hive/ql/parse/HiveParser.g
org/apache/hadoop/hive/ql/parse/HiveParser.g
Output file /data/hiveptest/working/apache-github-branch-2-source/ql/target/generated-sources/antlr3/org/apache/hadoop/hive/ql/parse/HintParser.java
does not exist: must build /data/hiveptest/working/apache-github-branch-2-source/ql/src/java/org/apache/hadoop/hive/ql/parse/HintParser.g
org/apache/hadoop/hive/ql/parse/HintParser.g
Generating vector expression code
Generating vector expression test code
[ERROR] Failed to execute goal on project hive-hbase-handler: Could not resolve dependencies
for project org.apache.hive:hive-hbase-handler:jar:2.4.0-SNAPSHOT: The following artifacts
could not be resolved: org.apache.hbase:hbase-hadoop2-compat:jar:1.1.1, org.apache.hbase:hbase-server:jar:1.1.1,
org.apache.hbase:hbase-procedure:jar:1.1.1, org.apache.hbase:hbase-prefix-tree:jar:1.1.1,
org.mortbay.jetty:jetty-sslengine:jar:6.1.26, org.apache.hbase:hbase-hadoop-compat:jar:1.1.1,
org.apache.hbase:hbase-common:jar:tests:1.1.1: Could not find artifact org.apache.hbase:hbase-hadoop2-compat:jar:1.1.1
in datanucleus (http://www.datanucleus.org/downloads/maven2) -> [Help 1]
[ERROR] 
[ERROR] To see the full stack trace of the errors, re-run Maven with the -e switch.
[ERROR] Re-run Maven using the -X switch to enable full debug logging.
[ERROR] 
[ERROR] For more information about the errors and possible solutions, please read the following
articles:
[ERROR] [Help 1] http://cwiki.apache.org/confluence/display/MAVEN/DependencyResolutionException
[ERROR] 
[ERROR] After correcting the problems, you can resume the build with the command
[ERROR]   mvn <goals> -rf :hive-hbase-handler
+ result=1
+ '[' 1 -ne 0 ']'
+ rm -rf yetus_PreCommit-HIVE-Build-17002
+ exit 1
'
{noformat}

This message is automatically generated.

ATTACHMENT ID: 12966586 - PreCommit-HIVE-Build

> Spark test failed since HIVE-10632
> ----------------------------------
>
>                 Key: HIVE-21639
>                 URL: https://issues.apache.org/jira/browse/HIVE-21639
>             Project: Hive
>          Issue Type: Bug
>            Reporter: Yuming Wang
>            Assignee: Yuming Wang
>            Priority: Major
>         Attachments: HIVE-21639.branch-2.patch
>
>
> The bug fixed by HIVE-17561, I'd like to backport part of HIVE-17561 to fix this issue
for branch-2.



--
This message was sent by Atlassian JIRA
(v7.6.3#76005)

Mime
View raw message