hive-issues mailing list archives

Site index · List index
Message view « Date » · « Thread »
Top « Date » · « Thread »
From "Deepak Jaiswal (JIRA)" <j...@apache.org>
Subject [jira] [Commented] (HIVE-19454) Test failure : org.apache.hadoop.hive.ql.TestTxnCommands2.testNonAcidToAcidConversion1 fails with java.lang.AssertionError
Date Thu, 10 May 2018 18:27:00 GMT

    [ https://issues.apache.org/jira/browse/HIVE-19454?page=com.atlassian.jira.plugin.system.issuetabpanels:comment-tabpanel&focusedCommentId=16470908#comment-16470908
] 

Deepak Jaiswal commented on HIVE-19454:
---------------------------------------

If an order is not guaranteed then maybe we should always sort them before asserting?

> Test failure : org.apache.hadoop.hive.ql.TestTxnCommands2.testNonAcidToAcidConversion1
fails with java.lang.AssertionError
> --------------------------------------------------------------------------------------------------------------------------
>
>                 Key: HIVE-19454
>                 URL: https://issues.apache.org/jira/browse/HIVE-19454
>             Project: Hive
>          Issue Type: Bug
>         Environment: uname -a
> Linux pts00433-vm40 3.10.0-862.el7.ppc64le #1 SMP Wed Mar 21 22:20:19 UTC 2018 ppc64le
ppc64le ppc64le GNU/Linux
>            Reporter: Alisha Prabhu
>            Priority: Major
>         Attachments: HIVE-19454.1.patch
>
>
> org.apache.hadoop.hive.ql.TestTxnCommands2WithSplitUpdateAndVectorization.testNonAcidToAcidConversion1
refers to the same test case.
> Maven command used is : mvn -Dtest=TestTxnCommands2 test
> Error:
> {code:java}
> [INFO] Running org.apache.hadoop.hive.ql.TestTxnCommands2
> [ERROR] Tests run: 44, Failures: 1, Errors: 0, Skipped: 3, Time elapsed: 618.215 s <<<
FAILURE! - in org.apache.hadoop.hive.ql.TestTxnCommands2
> [ERROR] testNonAcidToAcidConversion1(org.apache.hadoop.hive.ql.TestTxnCommands2)  Time
elapsed: 17.557 s  <<< FAILURE!
> java.lang.AssertionError
>         at org.junit.Assert.fail(Assert.java:86)
>         at org.junit.Assert.assertTrue(Assert.java:41)
>         at org.junit.Assert.assertTrue(Assert.java:52)
>         at org.apache.hadoop.hive.ql.TestTxnCommands2.testNonAcidToAcidConversion1(TestTxnCommands2.java:499)
>         at sun.reflect.NativeMethodAccessorImpl.invoke0(Native Method)
>         at sun.reflect.NativeMethodAccessorImpl.invoke(NativeMethodAccessorImpl.java:62)
>         at sun.reflect.DelegatingMethodAccessorImpl.invoke(DelegatingMethodAccessorImpl.java:43)
>         at java.lang.reflect.Method.invoke(Method.java:498)
>         at org.junit.runners.model.FrameworkMethod$1.runReflectiveCall(FrameworkMethod.java:47)
>         at org.junit.internal.runners.model.ReflectiveCallable.run(ReflectiveCallable.java:12)
>         at org.junit.runners.model.FrameworkMethod.invokeExplosively(FrameworkMethod.java:44)
>         at org.junit.internal.runners.statements.InvokeMethod.evaluate(InvokeMethod.java:17)
>         at org.junit.internal.runners.statements.RunBefores.evaluate(RunBefores.java:26)
>         at org.junit.internal.runners.statements.RunAfters.evaluate(RunAfters.java:27)
>         at org.junit.rules.TestWatcher$1.evaluate(TestWatcher.java:55)
>         at org.junit.rules.ExpectedException$ExpectedExceptionStatement.evaluate(ExpectedException.java:168)
>         at org.junit.rules.RunRules.evaluate(RunRules.java:20)
>         at org.junit.runners.ParentRunner.runLeaf(ParentRunner.java:271)
>         at org.junit.runners.BlockJUnit4ClassRunner.runChild(BlockJUnit4ClassRunner.java:70)
>         at org.junit.runners.BlockJUnit4ClassRunner.runChild(BlockJUnit4ClassRunner.java:50)
>         at org.junit.runners.ParentRunner$3.run(ParentRunner.java:238)
>         at org.junit.runners.ParentRunner$1.schedule(ParentRunner.java:63)
>         at org.junit.runners.ParentRunner.runChildren(ParentRunner.java:236)
>         at org.junit.runners.ParentRunner.access$000(ParentRunner.java:53)
>         at org.junit.runners.ParentRunner$2.evaluate(ParentRunner.java:229)
>         at org.junit.runners.ParentRunner.run(ParentRunner.java:309)
>         at org.apache.maven.surefire.junit4.JUnit4Provider.execute(JUnit4Provider.java:365)
>         at org.apache.maven.surefire.junit4.JUnit4Provider.executeWithRerun(JUnit4Provider.java:273)
>         at org.apache.maven.surefire.junit4.JUnit4Provider.executeTestSet(JUnit4Provider.java:238)
>         at org.apache.maven.surefire.junit4.JUnit4Provider.invoke(JUnit4Provider.java:159)
>         at org.apache.maven.surefire.booter.ForkedBooter.invokeProviderInSameClassLoader(ForkedBooter.java:379)
>         at org.apache.maven.surefire.booter.ForkedBooter.runSuitesInProcess(ForkedBooter.java:340)
>         at org.apache.maven.surefire.booter.ForkedBooter.execute(ForkedBooter.java:125)
>         at org.apache.maven.surefire.booter.ForkedBooter.main(ForkedBooter.java:413)
> [INFO]
> [INFO] Results:
> [INFO]
> [ERROR] Failures:
> [ERROR]   TestTxnCommands2.testNonAcidToAcidConversion1:499
> [INFO]
> [ERROR] Tests run: 44, Failures: 1, Errors: 0, Skipped: 3
> {code}



--
This message was sent by Atlassian JIRA
(v7.6.3#76005)

Mime
View raw message