hive-issues mailing list archives

Site index · List index
Message view « Date » · « Thread »
Top « Date » · « Thread »
From "Eugene Koifman (JIRA)" <j...@apache.org>
Subject [jira] [Updated] (HIVE-19100) investigate TestStreaming failures
Date Tue, 03 Apr 2018 19:46:00 GMT

     [ https://issues.apache.org/jira/browse/HIVE-19100?page=com.atlassian.jira.plugin.system.issuetabpanels:all-tabpanel
]

Eugene Koifman updated HIVE-19100:
----------------------------------
    Attachment: HIVE-19100.03.patch

> investigate TestStreaming failures
> ----------------------------------
>
>                 Key: HIVE-19100
>                 URL: https://issues.apache.org/jira/browse/HIVE-19100
>             Project: Hive
>          Issue Type: Bug
>          Components: Transactions
>            Reporter: Eugene Koifman
>            Assignee: Eugene Koifman
>            Priority: Major
>         Attachments: HIVE-19100.01.patch, HIVE-19100.02.patch, HIVE-19100.03.patch
>
>
> {noformat}
> [ERROR] Failures: 
> [ERROR]   TestStreaming.testInterleavedTransactionBatchCommits:1218->checkDataWritten2:619
expected:<11> but was:<12>
> [ERROR]   TestStreaming.testMultipleTransactionBatchCommits:1157->checkDataWritten2:619
expected:<1> but was:<3>
> [ERROR]   TestStreaming.testTransactionBatchAbortAndCommit:1138->checkDataWritten:566
expected:<1> but was:<2>
> [ERROR]   TestStreaming.testTransactionBatchCommit_Delimited:861->testTransactionBatchCommit_Delimited:881->checkDataWritten:566
expected:<1> but was:<3>
> [ERROR]   TestStreaming.testTransactionBatchCommit_DelimitedUGI:865->testTransactionBatchCommit_Delimited:881->checkDataWritten:566
expected:<1> but was:<3>
> [ERROR]   TestStreaming.testTransactionBatchCommit_Json:1011->checkDataWritten:566
expected:<1> but was:<3>
> [ERROR]   TestStreaming.testTransactionBatchCommit_Regex:928->testTransactionBatchCommit_Regex:949->checkDataWritten:566
expected:<1> but was:<3>
> [ERROR]   TestStreaming.testTransactionBatchCommit_RegexUGI:932->testTransactionBatchCommit_Regex:949->checkDataWritten:566
expected:<1> but was:<3>
> [INFO] 
> [ERROR] Tests run: 26, Failures: 8, Errors: 0, Skipped: 0
> {noformat}



--
This message was sent by Atlassian JIRA
(v7.6.3#76005)

Mime
View raw message