hive-issues mailing list archives

Site index · List index
Message view « Date » · « Thread »
Top « Date » · « Thread »
From "Hive QA (JIRA)" <j...@apache.org>
Subject [jira] [Commented] (HIVE-16302) Add junit dependency to hive-shims-common to compile with Hadoop 2.8+
Date Mon, 27 Mar 2017 05:04:41 GMT

    [ https://issues.apache.org/jira/browse/HIVE-16302?page=com.atlassian.jira.plugin.system.issuetabpanels:comment-tabpanel&focusedCommentId=15942653#comment-15942653
] 

Hive QA commented on HIVE-16302:
--------------------------------



Here are the results of testing the latest attachment:
https://issues.apache.org/jira/secure/attachment/12860588/HIVE-16302.01.patch

{color:red}ERROR:{color} -1 due to no test(s) being added or modified.

{color:red}ERROR:{color} -1 due to 2 failed/errored test(s), 10513 tests executed
*Failed tests:*
{noformat}
org.apache.hadoop.hive.cli.TestCliDriver.testCliDriver[comments] (batchId=35)
org.apache.hive.hcatalog.api.TestHCatClient.testTransportFailure (batchId=172)
{noformat}

Test results: https://builds.apache.org/job/PreCommit-HIVE-Build/4393/testReport
Console output: https://builds.apache.org/job/PreCommit-HIVE-Build/4393/console
Test logs: http://104.198.109.242/logs/PreCommit-HIVE-Build-4393/

Messages:
{noformat}
Executing org.apache.hive.ptest.execution.TestCheckPhase
Executing org.apache.hive.ptest.execution.PrepPhase
Executing org.apache.hive.ptest.execution.ExecutionPhase
Executing org.apache.hive.ptest.execution.ReportingPhase
Tests exited with: TestsFailedException: 2 tests failed
{noformat}

This message is automatically generated.

ATTACHMENT ID: 12860588 - PreCommit-HIVE-Build

> Add junit dependency to hive-shims-common to compile with Hadoop 2.8+
> ---------------------------------------------------------------------
>
>                 Key: HIVE-16302
>                 URL: https://issues.apache.org/jira/browse/HIVE-16302
>             Project: Hive
>          Issue Type: Bug
>            Reporter: Akira Ajisaka
>            Assignee: Akira Ajisaka
>         Attachments: HIVE-16302.01.patch
>
>
> Compile error when setting hadoop.version to 2.9.0-SNAPSHOT:
> {noformat}
> [ERROR] Failed to execute goal org.apache.maven.plugins:maven-compiler-plugin:3.6.1:testCompile
(default-testCompile) on project hive-shims-common: Compilation failure: Compilation failure:
> [ERROR] /Users/ajisaka/git/hive/shims/common/src/main/test/org/apache/hadoop/hive/io/TestHdfsUtils.java:[34,17]
package org.junit does not exist
> [ERROR] /Users/ajisaka/git/hive/shims/common/src/main/test/org/apache/hadoop/hive/io/TestHdfsUtils.java
> {noformat}



--
This message was sent by Atlassian JIRA
(v6.3.15#6346)

Mime
View raw message