hive-issues mailing list archives

Site index · List index
Message view « Date » · « Thread »
Top « Date » · « Thread »
From "Hive QA (JIRA)" <j...@apache.org>
Subject [jira] [Commented] (HIVE-16007) When the query does not complie the LogRunnable never stops
Date Thu, 02 Mar 2017 14:19:45 GMT

    [ https://issues.apache.org/jira/browse/HIVE-16007?page=com.atlassian.jira.plugin.system.issuetabpanels:comment-tabpanel&focusedCommentId=15892314#comment-15892314
] 

Hive QA commented on HIVE-16007:
--------------------------------



Here are the results of testing the latest attachment:
https://issues.apache.org/jira/secure/attachment/12855595/HIVE-16007.3.patch

{color:red}ERROR:{color} -1 due to no test(s) being added or modified.

{color:red}ERROR:{color} -1 due to 12 failed/errored test(s), 10283 tests executed
*Failed tests:*
{noformat}
TestCommandProcessorFactory - did not produce a TEST-*.xml file (likely timed out) (batchId=272)
TestDbTxnManager - did not produce a TEST-*.xml file (likely timed out) (batchId=272)
TestDummyTxnManager - did not produce a TEST-*.xml file (likely timed out) (batchId=272)
TestHiveInputSplitComparator - did not produce a TEST-*.xml file (likely timed out) (batchId=272)
TestIndexType - did not produce a TEST-*.xml file (likely timed out) (batchId=272)
TestSplitFilter - did not produce a TEST-*.xml file (likely timed out) (batchId=272)
org.apache.hadoop.hive.cli.TestBeeLineDriver.testCliDriver[escape_comments] (batchId=229)
org.apache.hadoop.hive.cli.TestMiniLlapLocalCliDriver.testCliDriver[schema_evol_text_vec_table]
(batchId=147)
org.apache.hadoop.hive.cli.TestPerfCliDriver.testCliDriver[query14] (batchId=224)
org.apache.hadoop.hive.cli.TestPerfCliDriver.testCliDriver[query23] (batchId=224)
org.apache.hadoop.hive.cli.TestSparkCliDriver.testCliDriver[vector_between_in] (batchId=119)
org.apache.hive.beeline.TestBeeLineWithArgs.testEmbeddedBeelineOutputs (batchId=212)
{noformat}

Test results: https://builds.apache.org/job/PreCommit-HIVE-Build/3892/testReport
Console output: https://builds.apache.org/job/PreCommit-HIVE-Build/3892/console
Test logs: http://104.198.109.242/logs/PreCommit-HIVE-Build-3892/

Messages:
{noformat}
Executing org.apache.hive.ptest.execution.TestCheckPhase
Executing org.apache.hive.ptest.execution.PrepPhase
Executing org.apache.hive.ptest.execution.ExecutionPhase
Executing org.apache.hive.ptest.execution.ReportingPhase
Tests exited with: TestsFailedException: 12 tests failed
{noformat}

This message is automatically generated.

ATTACHMENT ID: 12855595 - PreCommit-HIVE-Build

> When the query does not complie the LogRunnable never stops
> -----------------------------------------------------------
>
>                 Key: HIVE-16007
>                 URL: https://issues.apache.org/jira/browse/HIVE-16007
>             Project: Hive
>          Issue Type: Bug
>          Components: Beeline
>    Affects Versions: 2.2.0
>            Reporter: Peter Vary
>            Assignee: Peter Vary
>         Attachments: HIVE-16007.2.patch, HIVE-16007.3.patch, HIVE-16007.patch
>
>
> When issuing a sql command which does not compile then the LogRunnable thread is never
closed.
> The issue can be easily detected when running beeline with showWarnings=true.
> {code}
> $ ./beeline -u "jdbc:hive2://localhost:10000 pvary pvary" --showWarnings=true
> [..]
> Connecting to jdbc:hive2://localhost:10000
> Connected to: Apache Hive (version 2.2.0-SNAPSHOT)
> Driver: Hive JDBC (version 2.2.0-SNAPSHOT)
> Transaction isolation: TRANSACTION_REPEATABLE_READ
> Beeline version 2.2.0-SNAPSHOT by Apache Hive
> 0: jdbc:hive2://localhost:10000> selekt;
> Warning: java.sql.SQLException: Method getQueryLog() failed. Because the stmtHandle in
HiveStatement is null and the statement execution might fail. (state=,code=0)
> [..]
> Warning: java.sql.SQLException: Can't getQueryLog after statement has been closed (state=,code=0)
> [..]
> {code}



--
This message was sent by Atlassian JIRA
(v6.3.15#6346)

Mime
View raw message