hive-issues mailing list archives

Site index · List index
Message view « Date » · « Thread »
Top « Date » · « Thread »
From "Hive QA (JIRA)" <j...@apache.org>
Subject [jira] [Commented] (HIVE-12891) Hive fails when java.io.tmpdir is set to a relative location
Date Tue, 08 Nov 2016 10:32:58 GMT

    [ https://issues.apache.org/jira/browse/HIVE-12891?page=com.atlassian.jira.plugin.system.issuetabpanels:comment-tabpanel&focusedCommentId=15647171#comment-15647171
] 

Hive QA commented on HIVE-12891:
--------------------------------



Here are the results of testing the latest attachment:
https://issues.apache.org/jira/secure/attachment/12837939/HIVE-12891.5.patch

{color:green}SUCCESS:{color} +1 due to 2 test(s) being added or modified.

{color:red}ERROR:{color} -1 due to 7 failed/errored test(s), 10634 tests executed
*Failed tests:*
{noformat}
org.apache.hadoop.hive.cli.TestMiniLlapLocalCliDriver.testCliDriver[join_acid_non_acid] (batchId=150)
org.apache.hadoop.hive.cli.TestMiniLlapLocalCliDriver.testCliDriver[union_fast_stats] (batchId=145)
org.apache.hadoop.hive.cli.TestMiniTezCliDriver.testCliDriver[explainanalyze_2] (batchId=91)
org.apache.hadoop.hive.cli.TestMiniTezCliDriver.testCliDriver[explainanalyze_3] (batchId=90)
org.apache.hive.hcatalog.pig.TestAvroHCatStorer.testWriteDate (batchId=170)
org.apache.hive.hcatalog.pig.TestSequenceFileHCatStorer.testStoreInPartiitonedTbl (batchId=170)
org.apache.hive.hcatalog.pig.TestSequenceFileHCatStorer.testWriteSmallint (batchId=170)
{noformat}

Test results: https://builds.apache.org/job/PreCommit-HIVE-Build/2022/testReport
Console output: https://builds.apache.org/job/PreCommit-HIVE-Build/2022/console
Test logs: http://104.198.109.242/logs/PreCommit-HIVE-Build-2022/

Messages:
{noformat}
Executing org.apache.hive.ptest.execution.TestCheckPhase
Executing org.apache.hive.ptest.execution.PrepPhase
Executing org.apache.hive.ptest.execution.ExecutionPhase
Executing org.apache.hive.ptest.execution.ReportingPhase
Tests exited with: TestsFailedException: 7 tests failed
{noformat}

This message is automatically generated.

ATTACHMENT ID: 12837939 - PreCommit-HIVE-Build

> Hive fails when java.io.tmpdir is set to a relative location
> ------------------------------------------------------------
>
>                 Key: HIVE-12891
>                 URL: https://issues.apache.org/jira/browse/HIVE-12891
>             Project: Hive
>          Issue Type: Bug
>            Reporter: Reuben Kuhnert
>            Assignee: Barna Zsombor Klara
>         Attachments: HIVE-12891.01.19.2016.01.patch, HIVE-12891.03.patch, HIVE-12891.04.patch,
HIVE-12891.5.patch, HIVE-12981.01.22.2016.02.patch
>
>
> The function {{SessionState.createSessionDirs}} fails when trying to create directories
where {{java.io.tmpdir}} is set to a relative location.
> {code}
> \[SubtaskRunner] ERROR o.a.h.hive..ql.Driver - FAILED: IllegalArgumentException java.net.URISyntaxException:
Relative path in absolute URI: file:./tmp/<user>/<guid>/hive_2015_12_11_09-12-25_352_4325234652356-1
> ...
> Minor variations:
> \[SubtaskRunner] ERROR o.a.h.hive..ql.Driver - FAILED: SemanticException Exception while
processing Exception while writing out the local file 
> o.a.h.hive.ql/parse.SemanticException: Exception while processing exception while writing
out local file 
> ... 
> caused by: java.lang.IllegalArgumentException: java.net.URISyntaxException: Relative
path in absolute URI: file:./tmp/<user>/<guid>/hive_2015_12_11_09-12-25_352_4325234652356-1

> at o.a.h.fs.Path.initialize (206) 
> at o.a.h.fs.Path.<init>(197)... 
> at o.a.h.hive.ql.context.getScratchDir(267) 
> {code}



--
This message was sent by Atlassian JIRA
(v6.3.4#6332)

Mime
View raw message