hive-issues mailing list archives

Site index · List index
Message view « Date » · « Thread »
Top « Date » · « Thread »
From "Daniel Dai (JIRA)" <>
Subject [jira] [Commented] (HIVE-14968) Fix compilation failure on branch-1
Date Sat, 22 Oct 2016 05:07:58 GMT


Daniel Dai commented on HIVE-14968:

Seems the test failures are real. Here is one stack I saw:
java.lang.Exception: java.lang.RuntimeException: Error in configuring object
        at org.apache.hadoop.mapred.LocalJobRunner$Job.runTasks(
        at org.apache.hadoop.mapred.LocalJobRunner$
Caused by: java.lang.RuntimeException: Error in configuring object
        at org.apache.hadoop.util.ReflectionUtils.setJobConf(
        at org.apache.hadoop.util.ReflectionUtils.setConf(
        at org.apache.hadoop.util.ReflectionUtils.newInstance(
        at org.apache.hadoop.mapred.ReduceTask.runOldReducer(
        at org.apache.hadoop.mapred.LocalJobRunner$Job$
        at java.util.concurrent.Executors$
        at java.util.concurrent.ThreadPoolExecutor.runWorker(
        at java.util.concurrent.ThreadPoolExecutor$
Caused by: java.lang.reflect.InvocationTargetException
        at sun.reflect.GeneratedMethodAccessor16.invoke(Unknown Source)
        at sun.reflect.DelegatingMethodAccessorImpl.invoke(
        at java.lang.reflect.Method.invoke(
        at org.apache.hadoop.util.ReflectionUtils.setJobConf(
        ... 10 more
Caused by: java.lang.RuntimeException: Reduce operator initialization failed
        ... 14 more
Caused by: java.lang.RuntimeException: Cannot find ExprNodeEvaluator for the exprNodeDesc
= null
        at org.apache.hadoop.hive.ql.exec.ExprNodeEvaluatorFactory.get(
        at org.apache.hadoop.hive.ql.exec.GroupByOperator.initializeOp(
        at org.apache.hadoop.hive.ql.exec.Operator.initialize(
        at org.apache.hadoop.hive.ql.exec.Operator.initialize(
        at org.apache.hadoop.hive.ql.exec.Operator.initializeChildren(
        at org.apache.hadoop.hive.ql.exec.Operator.initialize(
        ... 14 more

But since this Jira is for the compilation error, I will commit the patch and create a separate
ticket for test fixes.

> Fix compilation failure on branch-1
> -----------------------------------
>                 Key: HIVE-14968
>                 URL:
>             Project: Hive
>          Issue Type: Bug
>            Reporter: Daniel Dai
>            Assignee: Daniel Dai
>             Fix For: 1.3.0
>         Attachments: HIVE-14968-branch-1.1.patch, HIVE-14968-branch-1.2.patch, HIVE-14968.1.patch,
> branch-1 compilation failure due to:
> HIVE-14436: Hive 1.2.1/Hitting "ql.Driver: FAILED: IllegalArgumentException Error: ,
expected at the end of 'decimal(9'" after enabling hive.optimize.skewjoin and with MR engine
> HIVE-14483 : java.lang.ArrayIndexOutOfBoundsException org.apache.orc.impl.TreeReaderFactory.commonReadByteArrays
> 1.2 branch is fine.

This message was sent by Atlassian JIRA

View raw message