hive-issues mailing list archives

Site index · List index
Message view « Date » · « Thread »
Top « Date » · « Thread »
From "Hive QA (JIRA)" <j...@apache.org>
Subject [jira] [Commented] (HIVE-14029) Update Spark version to 2.0.0
Date Sun, 18 Sep 2016 03:24:20 GMT

    [ https://issues.apache.org/jira/browse/HIVE-14029?page=com.atlassian.jira.plugin.system.issuetabpanels:comment-tabpanel&focusedCommentId=15500150#comment-15500150
] 

Hive QA commented on HIVE-14029:
--------------------------------



Here are the results of testing the latest attachment:
https://issues.apache.org/jira/secure/attachment/12829082/HIVE-14029.patch

{color:red}ERROR:{color} -1 due to build exiting with an error

Test results: https://builds.apache.org/job/jenkins-PreCommit-HIVE-Build/1227/testReport
Console output: https://builds.apache.org/job/jenkins-PreCommit-HIVE-Build/1227/console
Test logs: http://ec2-204-236-174-241.us-west-1.compute.amazonaws.com/logs/jenkins-PreCommit-HIVE-Build-1227/

Messages:
{noformat}
**** This message was trimmed, see log for full details ****
[loading ZipFileIndexFileObject[/usr/java/jdk1.8.0_25/jre/lib/rt.jar(java/util/concurrent/ConcurrentHashMap.class)]]
[loading ZipFileIndexFileObject[/usr/java/jdk1.8.0_25/jre/lib/rt.jar(java/io/FileNotFoundException.class)]]
[loading ZipFileIndexFileObject[/usr/java/jdk1.8.0_25/jre/lib/rt.jar(java/net/URISyntaxException.class)]]
[loading ZipFileIndexFileObject[/usr/java/jdk1.8.0_25/jre/lib/rt.jar(java/lang/Integer.class)]]
[loading ZipFileIndexFileObject[/data/hive-ptest/working/apache-github-source-source/metastore/target/hive-metastore-2.2.0-SNAPSHOT.jar(org/apache/hadoop/hive/metastore/IMetaStoreClient.class)]]
[loading ZipFileIndexFileObject[/data/hive-ptest/working/apache-github-source-source/metastore/target/hive-metastore-2.2.0-SNAPSHOT.jar(org/apache/hadoop/hive/metastore/api/MetaException.class)]]
[loading ZipFileIndexFileObject[/data/hive-ptest/working/maven/org/apache/hadoop/hadoop-common/2.7.2/hadoop-common-2.7.2.jar(org/apache/hadoop/io/Text.class)]]
[loading ZipFileIndexFileObject[/data/hive-ptest/working/maven/org/apache/hadoop/hadoop-common/2.7.2/hadoop-common-2.7.2.jar(org/apache/hadoop/security/Credentials.class)]]
[loading ZipFileIndexFileObject[/data/hive-ptest/working/maven/org/apache/hadoop/hadoop-common/2.7.2/hadoop-common-2.7.2.jar(org/apache/hadoop/security/token/Token.class)]]
[loading ZipFileIndexFileObject[/data/hive-ptest/working/apache-github-source-source/hcatalog/core/target/hive-hcatalog-core-2.2.0-SNAPSHOT.jar(org/apache/hive/hcatalog/common/HCatUtil.class)]]
[loading ZipFileIndexFileObject[/data/hive-ptest/working/maven/org/apache/thrift/libthrift/0.9.3/libthrift-0.9.3.jar(org/apache/thrift/TException.class)]]
[loading ZipFileIndexFileObject[/data/hive-ptest/working/maven/org/apache/hadoop/hadoop-common/2.7.2/hadoop-common-2.7.2.jar(org/apache/hadoop/security/Groups.class)]]
[loading ZipFileIndexFileObject[/usr/java/jdk1.8.0_25/jre/lib/rt.jar(java/util/HashSet.class)]]
[loading ZipFileIndexFileObject[/usr/java/jdk1.8.0_25/jre/lib/rt.jar(java/util/Set.class)]]
[loading ZipFileIndexFileObject[/usr/java/jdk1.8.0_25/jre/lib/rt.jar(java/util/Date.class)]]
[loading ZipFileIndexFileObject[/data/hive-ptest/working/apache-github-source-source/common/target/hive-common-2.2.0-SNAPSHOT.jar(org/apache/hadoop/hive/common/classification/InterfaceAudience$Private.class)]]
[loading ZipFileIndexFileObject[/usr/java/jdk1.8.0_25/jre/lib/rt.jar(java/io/BufferedReader.class)]]
[loading ZipFileIndexFileObject[/usr/java/jdk1.8.0_25/jre/lib/rt.jar(java/io/InputStream.class)]]
[loading ZipFileIndexFileObject[/usr/java/jdk1.8.0_25/jre/lib/rt.jar(java/io/InputStreamReader.class)]]
[loading ZipFileIndexFileObject[/usr/java/jdk1.8.0_25/jre/lib/rt.jar(java/io/PrintWriter.class)]]
[loading ZipFileIndexFileObject[/usr/java/jdk1.8.0_25/jre/lib/rt.jar(java/util/Map$Entry.class)]]
[loading ZipFileIndexFileObject[/usr/java/jdk1.8.0_25/jre/lib/rt.jar(java/util/concurrent/Semaphore.class)]]
[loading ZipFileIndexFileObject[/data/hive-ptest/working/maven/org/apache/commons/commons-exec/1.1/commons-exec-1.1.jar(org/apache/commons/exec/CommandLine.class)]]
[loading ZipFileIndexFileObject[/data/hive-ptest/working/maven/org/apache/commons/commons-exec/1.1/commons-exec-1.1.jar(org/apache/commons/exec/DefaultExecutor.class)]]
[loading ZipFileIndexFileObject[/data/hive-ptest/working/maven/org/apache/commons/commons-exec/1.1/commons-exec-1.1.jar(org/apache/commons/exec/ExecuteWatchdog.class)]]
[loading ZipFileIndexFileObject[/data/hive-ptest/working/maven/org/apache/commons/commons-exec/1.1/commons-exec-1.1.jar(org/apache/commons/exec/PumpStreamHandler.class)]]
[loading ZipFileIndexFileObject[/data/hive-ptest/working/maven/org/apache/hadoop/hadoop-common/2.7.2/hadoop-common-2.7.2.jar(org/apache/hadoop/util/Shell.class)]]
[loading ZipFileIndexFileObject[/usr/java/jdk1.8.0_25/jre/lib/rt.jar(java/lang/Thread.class)]]
[loading ZipFileIndexFileObject[/usr/java/jdk1.8.0_25/jre/lib/rt.jar(java/lang/Runnable.class)]]
[loading ZipFileIndexFileObject[/usr/java/jdk1.8.0_25/jre/lib/rt.jar(java/io/DataInput.class)]]
[loading ZipFileIndexFileObject[/usr/java/jdk1.8.0_25/jre/lib/rt.jar(java/io/DataOutput.class)]]
[loading ZipFileIndexFileObject[/data/hive-ptest/working/maven/org/apache/hadoop/hadoop-mapreduce-client-core/2.7.2/hadoop-mapreduce-client-core-2.7.2.jar(org/apache/hadoop/mapreduce/InputSplit.class)]]
[loading ZipFileIndexFileObject[/usr/java/jdk1.8.0_25/jre/lib/rt.jar(java/io/OutputStreamWriter.class)]]
[loading ZipFileIndexFileObject[/data/hive-ptest/working/maven/org/apache/curator/curator-framework/2.7.1/curator-framework-2.7.1.jar(org/apache/curator/framework/CuratorFramework.class)]]
[loading ZipFileIndexFileObject[/data/hive-ptest/working/maven/org/apache/hadoop/hadoop-common/2.7.2/hadoop-common-2.7.2.jar(org/apache/hadoop/io/NullWritable.class)]]
[loading ZipFileIndexFileObject[/data/hive-ptest/working/maven/org/apache/hadoop/hadoop-mapreduce-client-core/2.7.2/hadoop-mapreduce-client-core-2.7.2.jar(org/apache/hadoop/mapreduce/RecordReader.class)]]
[loading ZipFileIndexFileObject[/data/hive-ptest/working/maven/org/apache/hadoop/hadoop-mapreduce-client-core/2.7.2/hadoop-mapreduce-client-core-2.7.2.jar(org/apache/hadoop/mapreduce/TaskAttemptContext.class)]]
[loading ZipFileIndexFileObject[/data/hive-ptest/working/maven/org/apache/zookeeper/zookeeper/3.4.6/zookeeper-3.4.6.jar(org/apache/zookeeper/CreateMode.class)]]
[loading ZipFileIndexFileObject[/data/hive-ptest/working/maven/org/apache/zookeeper/zookeeper/3.4.6/zookeeper-3.4.6.jar(org/apache/zookeeper/KeeperException.class)]]
[loading ZipFileIndexFileObject[/data/hive-ptest/working/maven/org/apache/zookeeper/zookeeper/3.4.6/zookeeper-3.4.6.jar(org/apache/zookeeper/ZooDefs.class)]]
[loading ZipFileIndexFileObject[/data/hive-ptest/working/maven/org/apache/zookeeper/zookeeper/3.4.6/zookeeper-3.4.6.jar(org/apache/zookeeper/ZooDefs$Ids.class)]]
[loading ZipFileIndexFileObject[/data/hive-ptest/working/maven/org/apache/hadoop/hadoop-mapreduce-client-core/2.7.2/hadoop-mapreduce-client-core-2.7.2.jar(org/apache/hadoop/mapreduce/InputFormat.class)]]
[loading ZipFileIndexFileObject[/data/hive-ptest/working/maven/org/apache/hadoop/hadoop-mapreduce-client-core/2.7.2/hadoop-mapreduce-client-core-2.7.2.jar(org/apache/hadoop/mapreduce/JobContext.class)]]
[loading ZipFileIndexFileObject[/data/hive-ptest/working/apache-github-source-source/common/target/hive-common-2.2.0-SNAPSHOT.jar(org/apache/hadoop/hive/common/classification/InterfaceStability$Evolving.class)]]
[loading ZipFileIndexFileObject[/usr/java/jdk1.8.0_25/jre/lib/rt.jar(java/net/URLConnection.class)]]
[loading ZipFileIndexFileObject[/usr/java/jdk1.8.0_25/jre/lib/rt.jar(java/net/URLDecoder.class)]]
[loading ZipFileIndexFileObject[/usr/java/jdk1.8.0_25/jre/lib/rt.jar(java/util/Enumeration.class)]]
[loading ZipFileIndexFileObject[/usr/java/jdk1.8.0_25/jre/lib/rt.jar(java/util/Properties.class)]]
[loading ZipFileIndexFileObject[/usr/java/jdk1.8.0_25/jre/lib/rt.jar(java/util/StringTokenizer.class)]]
[loading ZipFileIndexFileObject[/data/hive-ptest/working/maven/com/sun/jersey/jersey-core/1.14/jersey-core-1.14.jar(javax/ws/rs/core/UriBuilder.class)]]
[loading ZipFileIndexFileObject[/data/hive-ptest/working/apache-github-source-source/common/target/hive-common-2.2.0-SNAPSHOT.jar(org/apache/hadoop/hive/common/LogUtils.class)]]
[loading ZipFileIndexFileObject[/usr/java/jdk1.8.0_25/jre/lib/rt.jar(java/lang/Class.class)]]
[loading ZipFileIndexFileObject[/usr/java/jdk1.8.0_25/jre/lib/rt.jar(java/lang/StringBuilder.class)]]
[loading ZipFileIndexFileObject[/data/hive-ptest/working/maven/org/apache/hadoop/hadoop-mapreduce-client-core/2.7.2/hadoop-mapreduce-client-core-2.7.2.jar(org/apache/hadoop/mapreduce/JobID.class)]]
[loading ZipFileIndexFileObject[/data/hive-ptest/working/maven/org/apache/hadoop/hadoop-mapreduce-client-core/2.7.2/hadoop-mapreduce-client-core-2.7.2.jar(org/apache/hadoop/mapreduce/Mapper.class)]]
[loading ZipFileIndexFileObject[/usr/java/jdk1.8.0_25/jre/lib/rt.jar(java/util/Iterator.class)]]
[loading ZipFileIndexFileObject[/usr/java/jdk1.8.0_25/jre/lib/rt.jar(java/util/LinkedList.class)]]
[loading ZipFileIndexFileObject[/usr/java/jdk1.8.0_25/jre/lib/rt.jar(java/util/concurrent/ExecutorService.class)]]
[loading ZipFileIndexFileObject[/usr/java/jdk1.8.0_25/jre/lib/rt.jar(java/util/concurrent/Executors.class)]]
[loading ZipFileIndexFileObject[/usr/java/jdk1.8.0_25/jre/lib/rt.jar(java/util/concurrent/TimeUnit.class)]]
[loading ZipFileIndexFileObject[/usr/java/jdk1.8.0_25/jre/lib/rt.jar(java/lang/Process.class)]]
[loading ZipFileIndexFileObject[/data/hive-ptest/working/maven/org/apache/hadoop/hadoop-mapreduce-client-core/2.7.2/hadoop-mapreduce-client-core-2.7.2.jar(org/apache/hadoop/mapreduce/Mapper$Context.class)]]
[loading ZipFileIndexFileObject[/data/hive-ptest/working/maven/org/apache/curator/curator-framework/2.7.1/curator-framework-2.7.1.jar(org/apache/curator/framework/CuratorFrameworkFactory.class)]]
[loading ZipFileIndexFileObject[/data/hive-ptest/working/maven/org/apache/curator/curator-client/2.7.1/curator-client-2.7.1.jar(org/apache/curator/retry/ExponentialBackoffRetry.class)]]
[loading ZipFileIndexFileObject[/data/hive-ptest/working/maven/org/apache/hadoop/hadoop-common/2.7.2/hadoop-common-2.7.2.jar(org/apache/hadoop/conf/Configured.class)]]
[loading ZipFileIndexFileObject[/data/hive-ptest/working/maven/org/apache/hadoop/hadoop-mapreduce-client-core/2.7.2/hadoop-mapreduce-client-core-2.7.2.jar(org/apache/hadoop/mapred/JobClient.class)]]
[loading ZipFileIndexFileObject[/data/hive-ptest/working/maven/org/apache/hadoop/hadoop-mapreduce-client-core/2.7.2/hadoop-mapreduce-client-core-2.7.2.jar(org/apache/hadoop/mapred/JobConf.class)]]
[loading ZipFileIndexFileObject[/data/hive-ptest/working/maven/org/apache/hadoop/hadoop-mapreduce-client-core/2.7.2/hadoop-mapreduce-client-core-2.7.2.jar(org/apache/hadoop/mapreduce/Job.class)]]
[loading ZipFileIndexFileObject[/data/hive-ptest/working/maven/org/apache/hadoop/hadoop-mapreduce-client-core/2.7.2/hadoop-mapreduce-client-core-2.7.2.jar(org/apache/hadoop/mapreduce/lib/output/NullOutputFormat.class)]]
[loading ZipFileIndexFileObject[/data/hive-ptest/working/maven/org/apache/hadoop/hadoop-mapreduce-client-core/2.7.2/hadoop-mapreduce-client-core-2.7.2.jar(org/apache/hadoop/mapreduce/security/token/delegation/DelegationTokenIdentifier.class)]]
[loading ZipFileIndexFileObject[/data/hive-ptest/working/maven/org/apache/hadoop/hadoop-common/2.7.2/hadoop-common-2.7.2.jar(org/apache/hadoop/util/Tool.class)]]
[loading ZipFileIndexFileObject[/data/hive-ptest/working/maven/org/apache/hadoop/hadoop-common/2.7.2/hadoop-common-2.7.2.jar(org/apache/hadoop/conf/Configurable.class)]]
[loading ZipFileIndexFileObject[/usr/java/jdk1.8.0_25/jre/lib/rt.jar(java/lang/ClassNotFoundException.class)]]
[loading ZipFileIndexFileObject[/data/hive-ptest/working/maven/org/apache/hadoop/hadoop-mapreduce-client-core/2.7.2/hadoop-mapreduce-client-core-2.7.2.jar(org/apache/hadoop/mapred/RunningJob.class)]]
[loading ZipFileIndexFileObject[/data/hive-ptest/working/maven/org/apache/hadoop/hadoop-annotations/2.7.2/hadoop-annotations-2.7.2.jar(org/apache/hadoop/classification/InterfaceAudience.class)]]
[loading ZipFileIndexFileObject[/data/hive-ptest/working/maven/org/apache/hadoop/hadoop-annotations/2.7.2/hadoop-annotations-2.7.2.jar(org/apache/hadoop/classification/InterfaceAudience$LimitedPrivate.class)]]
[loading ZipFileIndexFileObject[/usr/java/jdk1.8.0_25/jre/lib/rt.jar(java/lang/annotation/Annotation.class)]]
[loading ZipFileIndexFileObject[/usr/java/jdk1.8.0_25/jre/lib/rt.jar(java/lang/SuppressWarnings.class)]]
[loading ZipFileIndexFileObject[/usr/java/jdk1.8.0_25/jre/lib/rt.jar(java/lang/annotation/Retention.class)]]
[loading ZipFileIndexFileObject[/usr/java/jdk1.8.0_25/jre/lib/rt.jar(java/lang/annotation/RetentionPolicy.class)]]
[loading ZipFileIndexFileObject[/usr/java/jdk1.8.0_25/jre/lib/rt.jar(java/lang/annotation/Target.class)]]
[loading ZipFileIndexFileObject[/usr/java/jdk1.8.0_25/jre/lib/rt.jar(java/lang/annotation/ElementType.class)]]
[loading ZipFileIndexFileObject[/data/hive-ptest/working/maven/com/sun/jersey/jersey-core/1.14/jersey-core-1.14.jar(javax/ws/rs/HttpMethod.class)]]
[loading ZipFileIndexFileObject[/usr/java/jdk1.8.0_25/jre/lib/rt.jar(java/lang/Override.class)]]
[loading ZipFileIndexFileObject[/usr/java/jdk1.8.0_25/jre/lib/rt.jar(sun/misc/Contended.class)]]
[loading RegularFileObject[/data/hive-ptest/working/apache-github-source-source/hcatalog/webhcat/svr/target/classes/org/apache/hive/hcatalog/templeton/SecureProxySupport$3.class]]
[loading RegularFileObject[/data/hive-ptest/working/apache-github-source-source/hcatalog/webhcat/svr/target/classes/org/apache/hive/hcatalog/templeton/HcatDelegator$1.class]]
[loading RegularFileObject[/data/hive-ptest/working/apache-github-source-source/hcatalog/webhcat/svr/target/classes/org/apache/hive/hcatalog/templeton/LauncherDelegator$1.class]]
[loading RegularFileObject[/data/hive-ptest/working/apache-github-source-source/hcatalog/webhcat/svr/target/classes/org/apache/hive/hcatalog/templeton/Server$1.class]]
[loading RegularFileObject[/data/hive-ptest/working/apache-github-source-source/hcatalog/webhcat/svr/target/classes/org/apache/hive/hcatalog/templeton/HcatException$1.class]]
[loading RegularFileObject[/data/hive-ptest/working/apache-github-source-source/hcatalog/webhcat/svr/target/classes/org/apache/hive/hcatalog/templeton/SecureProxySupport$2.class]]
[loading RegularFileObject[/data/hive-ptest/working/apache-github-source-source/hcatalog/webhcat/svr/target/classes/org/apache/hive/hcatalog/templeton/SecureProxySupport$1.class]]
[loading RegularFileObject[/data/hive-ptest/working/apache-github-source-source/hcatalog/webhcat/svr/target/classes/org/apache/hive/hcatalog/templeton/tool/LogRetriever$1.class]]
[loading RegularFileObject[/data/hive-ptest/working/apache-github-source-source/hcatalog/webhcat/svr/target/classes/org/apache/hive/hcatalog/templeton/tool/HDFSStorage$1.class]]
[loading RegularFileObject[/data/hive-ptest/working/apache-github-source-source/hcatalog/webhcat/svr/target/classes/org/apache/hive/hcatalog/templeton/tool/ZooKeeperStorage$1.class]]
[loading RegularFileObject[/data/hive-ptest/working/apache-github-source-source/hcatalog/webhcat/svr/target/classes/org/apache/hive/hcatalog/templeton/tool/TempletonUtils$1.class]]
[loading RegularFileObject[/data/hive-ptest/working/apache-github-source-source/hcatalog/webhcat/svr/target/classes/org/apache/hive/hcatalog/templeton/tool/TempletonControllerJob$1.class]]
[loading RegularFileObject[/data/hive-ptest/working/apache-github-source-source/hcatalog/webhcat/svr/target/classes/org/apache/hive/hcatalog/templeton/tool/TempletonControllerJob$1$1.class]]
[done in 2216 ms]
[WARNING] Javadoc Warnings
[WARNING] Sep 18, 2016 3:24:28 AM com.sun.jersey.wadl.resourcedoc.ResourceDoclet start
[WARNING] INFO: Wrote /data/hive-ptest/working/apache-github-source-source/hcatalog/webhcat/svr/target/classes/resourcedoc.xml
[INFO] 
[INFO] --- maven-resources-plugin:2.6:testResources (default-testResources) @ hive-webhcat
---
[INFO] Using 'UTF-8' encoding to copy filtered resources.
[INFO] skip non existing resourceDirectory /data/hive-ptest/working/apache-github-source-source/hcatalog/webhcat/svr/src/test/resources
[INFO] Copying 3 resources
[INFO] 
[INFO] --- maven-antrun-plugin:1.7:run (setup-test-dirs) @ hive-webhcat ---
[INFO] Executing tasks

main:
    [mkdir] Created dir: /data/hive-ptest/working/apache-github-source-source/hcatalog/webhcat/svr/target/tmp
    [mkdir] Created dir: /data/hive-ptest/working/apache-github-source-source/hcatalog/webhcat/svr/target/warehouse
    [mkdir] Created dir: /data/hive-ptest/working/apache-github-source-source/hcatalog/webhcat/svr/target/tmp/conf
     [copy] Copying 15 files to /data/hive-ptest/working/apache-github-source-source/hcatalog/webhcat/svr/target/tmp/conf
[INFO] Executed tasks
[INFO] 
[INFO] --- maven-compiler-plugin:3.1:testCompile (default-testCompile) @ hive-webhcat ---
[INFO] Compiling 9 source files to /data/hive-ptest/working/apache-github-source-source/hcatalog/webhcat/svr/target/test-classes
[INFO] -------------------------------------------------------------
[WARNING] COMPILATION WARNING : 
[INFO] -------------------------------------------------------------
[WARNING] /data/hive-ptest/working/apache-github-source-source/hcatalog/webhcat/svr/src/test/java/org/apache/hive/hcatalog/templeton/TestWebHCatE2e.java:
Some input files use or override a deprecated API.
[WARNING] /data/hive-ptest/working/apache-github-source-source/hcatalog/webhcat/svr/src/test/java/org/apache/hive/hcatalog/templeton/TestWebHCatE2e.java:
Recompile with -Xlint:deprecation for details.
[WARNING] /data/hive-ptest/working/apache-github-source-source/hcatalog/webhcat/svr/src/test/java/org/apache/hive/hcatalog/templeton/TestWebHCatE2e.java:
Some input files use unchecked or unsafe operations.
[WARNING] /data/hive-ptest/working/apache-github-source-source/hcatalog/webhcat/svr/src/test/java/org/apache/hive/hcatalog/templeton/TestWebHCatE2e.java:
Recompile with -Xlint:unchecked for details.
[INFO] 4 warnings 
[INFO] -------------------------------------------------------------
[INFO] -------------------------------------------------------------
[ERROR] COMPILATION ERROR : 
[INFO] -------------------------------------------------------------
[ERROR] /data/hive-ptest/working/apache-github-source-source/hcatalog/webhcat/svr/src/test/java/org/apache/hive/hcatalog/templeton/mock/MockUriInfo.java:[67,3]
method does not override or implement a method from a supertype
[ERROR] /data/hive-ptest/working/apache-github-source-source/hcatalog/webhcat/svr/src/test/java/org/apache/hive/hcatalog/templeton/mock/MockUriInfo.java:[72,3]
method does not override or implement a method from a supertype
[INFO] 2 errors 
[INFO] -------------------------------------------------------------
[INFO] ------------------------------------------------------------------------
[INFO] Reactor Summary:
[INFO] 
[INFO] Hive .............................................. SUCCESS [1.987s]
[INFO] Hive Shims Common ................................. SUCCESS [3.928s]
[INFO] Hive Shims 0.23 ................................... SUCCESS [2.028s]
[INFO] Hive Shims Scheduler .............................. SUCCESS [0.789s]
[INFO] Hive Shims ........................................ SUCCESS [0.493s]
[INFO] Hive Storage API .................................. SUCCESS [1.208s]
[INFO] Hive ORC .......................................... SUCCESS [4.733s]
[INFO] Hive Common ....................................... SUCCESS [4.729s]
[INFO] Hive Service RPC .................................. SUCCESS [3.410s]
[INFO] Hive Serde ........................................ SUCCESS [3.448s]
[INFO] Hive Metastore .................................... SUCCESS [19.085s]
[INFO] Hive Ant Utilities ................................ SUCCESS [0.267s]
[INFO] Hive Llap Common .................................. SUCCESS [2.802s]
[INFO] Hive Llap Client .................................. SUCCESS [1.071s]
[INFO] Hive Llap Tez ..................................... SUCCESS [1.214s]
[INFO] Spark Remote Client ............................... SUCCESS [23.836s]
[INFO] Hive Query Language ............................... SUCCESS [53.022s]
[INFO] Hive Llap Server .................................. SUCCESS [3.353s]
[INFO] Hive Service ...................................... SUCCESS [3.861s]
[INFO] Hive Accumulo Handler ............................. SUCCESS [2.300s]
[INFO] Hive JDBC ......................................... SUCCESS [9.583s]
[INFO] Hive Beeline ...................................... SUCCESS [1.997s]
[INFO] Hive CLI .......................................... SUCCESS [1.501s]
[INFO] Hive Contrib ...................................... SUCCESS [0.808s]
[INFO] Hive Druid Handler ................................ SUCCESS [3.230s]
[INFO] Hive HBase Handler ................................ SUCCESS [2.421s]
[INFO] Hive HCatalog ..................................... SUCCESS [0.202s]
[INFO] Hive HCatalog Core ................................ SUCCESS [2.674s]
[INFO] Hive HCatalog Pig Adapter ......................... SUCCESS [2.686s]
[INFO] Hive HCatalog Server Extensions ................... SUCCESS [1.478s]
[INFO] Hive HCatalog Webhcat Java Client ................. SUCCESS [1.310s]
[INFO] Hive HCatalog Webhcat ............................. FAILURE [4.897s]
[INFO] Hive HCatalog Streaming ........................... SKIPPED
[INFO] Hive HPL/SQL ...................................... SKIPPED
[INFO] Hive HWI .......................................... SKIPPED
[INFO] Hive Llap External Client ......................... SKIPPED
[INFO] Hive Shims Aggregator ............................. SKIPPED
[INFO] Hive TestUtils .................................... SKIPPED
[INFO] Hive Packaging .................................... SKIPPED
[INFO] ------------------------------------------------------------------------
[INFO] BUILD FAILURE
[INFO] ------------------------------------------------------------------------
[INFO] Total time: 2:51.263s
[INFO] Finished at: Sun Sep 18 03:24:28 UTC 2016
[INFO] Final Memory: 254M/935M
[INFO] ------------------------------------------------------------------------
[ERROR] Failed to execute goal org.apache.maven.plugins:maven-compiler-plugin:3.1:testCompile
(default-testCompile) on project hive-webhcat: Compilation failure: Compilation failure:
[ERROR] /data/hive-ptest/working/apache-github-source-source/hcatalog/webhcat/svr/src/test/java/org/apache/hive/hcatalog/templeton/mock/MockUriInfo.java:[67,3]
method does not override or implement a method from a supertype
[ERROR] /data/hive-ptest/working/apache-github-source-source/hcatalog/webhcat/svr/src/test/java/org/apache/hive/hcatalog/templeton/mock/MockUriInfo.java:[72,3]
method does not override or implement a method from a supertype
[ERROR] -> [Help 1]
[ERROR] 
[ERROR] To see the full stack trace of the errors, re-run Maven with the -e switch.
[ERROR] Re-run Maven using the -X switch to enable full debug logging.
[ERROR] 
[ERROR] For more information about the errors and possible solutions, please read the following
articles:
[ERROR] [Help 1] http://cwiki.apache.org/confluence/display/MAVEN/MojoFailureException
[ERROR] 
[ERROR] After correcting the problems, you can resume the build with the command
[ERROR]   mvn <goals> -rf :hive-webhcat
+ exit 1
'
{noformat}

This message is automatically generated.

ATTACHMENT ID: 12829082 - jenkins-PreCommit-HIVE-Build

> Update Spark version to 2.0.0
> -----------------------------
>
>                 Key: HIVE-14029
>                 URL: https://issues.apache.org/jira/browse/HIVE-14029
>             Project: Hive
>          Issue Type: Bug
>            Reporter: Ferdinand Xu
>            Assignee: Ferdinand Xu
>         Attachments: HIVE-14029.patch
>
>
> There are quite some new optimizations in Spark 2.0.0. We need to bump up Spark to 2.0.0
to benefit those performance improvements.



--
This message was sent by Atlassian JIRA
(v6.3.4#6332)

Mime
View raw message