hive-issues mailing list archives

Site index · List index
Message view « Date » · « Thread »
Top « Date » · « Thread »
From "Hive QA (JIRA)" <j...@apache.org>
Subject [jira] [Commented] (HIVE-13000) Hive returns useless parsing error
Date Fri, 30 Sep 2016 15:34:21 GMT

    [ https://issues.apache.org/jira/browse/HIVE-13000?page=com.atlassian.jira.plugin.system.issuetabpanels:comment-tabpanel&focusedCommentId=15536287#comment-15536287
] 

Hive QA commented on HIVE-13000:
--------------------------------



Here are the results of testing the latest attachment:
https://issues.apache.org/jira/secure/attachment/12805602/HIVE-13000.4.patch

{color:red}ERROR:{color} -1 due to no test(s) being added or modified.

{color:red}ERROR:{color} -1 due to 8 failed/errored test(s), 10650 tests executed
*Failed tests:*
{noformat}
org.apache.hadoop.hive.cli.TestCliDriver.testCliDriver[acid_mapjoin]
org.apache.hadoop.hive.cli.TestCliDriver.testCliDriver[ctas]
org.apache.hadoop.hive.cli.TestCliDriver.testCliDriver[vector_join_part_col_char]
org.apache.hadoop.hive.cli.TestMiniTezCliDriver.testCliDriver[explainuser_3]
org.apache.hadoop.hive.cli.TestNegativeCliDriver.testCliDriver[subquery_notexists_implicit_gby]
org.apache.hadoop.hive.metastore.TestMetaStoreMetrics.testMetaDataCounts
org.apache.hadoop.hive.ql.parse.TestParseNegativeDriver.testCliDriver[nonkey_groupby]
org.apache.hive.jdbc.TestJdbcWithMiniHS2.testAddJarConstructorUnCaching
{noformat}

Test results: https://builds.apache.org/job/PreCommit-HIVE-Build/1361/testReport
Console output: https://builds.apache.org/job/PreCommit-HIVE-Build/1361/console
Test logs: http://ec2-204-236-174-241.us-west-1.compute.amazonaws.com/logs/PreCommit-HIVE-Build-1361/

Messages:
{noformat}
Executing org.apache.hive.ptest.execution.TestCheckPhase
Executing org.apache.hive.ptest.execution.PrepPhase
Executing org.apache.hive.ptest.execution.ExecutionPhase
Executing org.apache.hive.ptest.execution.ReportingPhase
Tests exited with: TestsFailedException: 8 tests failed
{noformat}

This message is automatically generated.

ATTACHMENT ID: 12805602 - PreCommit-HIVE-Build

> Hive returns useless parsing error 
> -----------------------------------
>
>                 Key: HIVE-13000
>                 URL: https://issues.apache.org/jira/browse/HIVE-13000
>             Project: Hive
>          Issue Type: Bug
>    Affects Versions: 0.13.0, 1.0.0, 1.2.1, 2.2.0
>            Reporter: Alina Abramova
>            Assignee: Alina Abramova
>            Priority: Minor
>         Attachments: HIVE-13000.1.patch, HIVE-13000.2.patch, HIVE-13000.3.patch, HIVE-13000.4.patch
>
>
> When I run query like these I receive unclear exception
> hive> SELECT record FROM ctest GROUP BY record.instance_id;
> FAILED: SemanticException Error in parsing 
> It will be clearer if it would be like:
> hive> SELECT record FROM ctest GROUP BY record.instance_id;
> FAILED: SemanticException  Expression not in GROUP BY key record



--
This message was sent by Atlassian JIRA
(v6.3.4#6332)

Mime
View raw message