hive-issues mailing list archives

Site index · List index
Message view « Date » · « Thread »
Top « Date » · « Thread »
From "Hive QA (JIRA)" <j...@apache.org>
Subject [jira] [Commented] (HIVE-12806) CBO: Calcite Operator To Hive Operator (Calcite Return Path): MiniTezCliDriver vector_auto_smb_mapjoin_14.q failure
Date Thu, 01 Sep 2016 00:47:20 GMT

    [ https://issues.apache.org/jira/browse/HIVE-12806?page=com.atlassian.jira.plugin.system.issuetabpanels:comment-tabpanel&focusedCommentId=15453888#comment-15453888
] 

Hive QA commented on HIVE-12806:
--------------------------------



Here are the results of testing the latest attachment:
https://issues.apache.org/jira/secure/attachment/12826490/HIVE-12806.4.patch

{color:green}SUCCESS:{color} +1 due to 1 test(s) being added or modified.

{color:red}ERROR:{color} -1 due to 3 failed/errored test(s), 10503 tests executed
*Failed tests:*
{noformat}
org.apache.hadoop.hive.cli.TestCliDriver.org.apache.hadoop.hive.cli.TestCliDriver
org.apache.hadoop.hive.cli.TestCliDriver.testCliDriver[vector_join_part_col_char]
org.apache.hadoop.hive.cli.TestMiniTezCliDriver.testCliDriver[explainuser_3]
{noformat}

Test results: https://builds.apache.org/job/PreCommit-HIVE-MASTER-Build/1062/testReport
Console output: https://builds.apache.org/job/PreCommit-HIVE-MASTER-Build/1062/console
Test logs: http://ec2-204-236-174-241.us-west-1.compute.amazonaws.com/logs/PreCommit-HIVE-MASTER-Build-1062/

Messages:
{noformat}
Executing org.apache.hive.ptest.execution.TestCheckPhase
Executing org.apache.hive.ptest.execution.PrepPhase
Executing org.apache.hive.ptest.execution.ExecutionPhase
Executing org.apache.hive.ptest.execution.ReportingPhase
Tests exited with: TestsFailedException: 3 tests failed
{noformat}

This message is automatically generated.

ATTACHMENT ID: 12826490 - PreCommit-HIVE-MASTER-Build

> CBO: Calcite Operator To Hive Operator (Calcite Return Path): MiniTezCliDriver vector_auto_smb_mapjoin_14.q
failure
> -------------------------------------------------------------------------------------------------------------------
>
>                 Key: HIVE-12806
>                 URL: https://issues.apache.org/jira/browse/HIVE-12806
>             Project: Hive
>          Issue Type: Sub-task
>          Components: CBO
>            Reporter: Hari Sankar Sivarama Subramaniyan
>            Assignee: Vineet Garg
>         Attachments: HIVE-12806.1.patch, HIVE-12806.2.patch, HIVE-12806.3.patch, HIVE-12806.4.patch
>
>
> Step to reproduce:
> mvn test -Dtest=TestMiniTezCliDriver -Dqfile=vector_auto_smb_mapjoin_14.q -Dhive.cbo.returnpath.hiveop=true
-Dtest.output.overwrite=true
> Query :
> {code}
> select count(*) from (
>   select a.key as key, a.value as val1, b.value as val2 from tbl1 a join tbl2 b on a.key
= b.key
> ) subq1
> {code}
> Stack trace :
> {code}
> 2016-01-07T14:08:04,803 ERROR [da534038-d792-4d16-86e9-87b9f971adda main[]]: SessionState
(SessionState.java:printError(1010)) - Vertex failed, vertexName=Map 1, vertexId=vertex_1452204324051_0001_33_00,
diagnostics=[Vertex vertex_1452204324051_0001_33_00 [Map 1] k\
> illed/failed due to:AM_USERCODE_FAILURE, Exception in VertexManager, vertex:vertex_1452204324051_0001_33_00
[Map 1], java.lang.RuntimeException: java.lang.RuntimeException: Failed to load plan: null:
java.lang.IllegalArgumentException: java.net.URISyntaxException: \
> Relative path in absolute URI: subq1:amerge.xml
>         at org.apache.hadoop.hive.ql.exec.tez.CustomPartitionVertex.onRootVertexInitialized(CustomPartitionVertex.java:314)
>         at org.apache.tez.dag.app.dag.impl.VertexManager$VertexManagerEventRootInputInitialized.invoke(VertexManager.java:624)
>         at org.apache.tez.dag.app.dag.impl.VertexManager$VertexManagerEvent$1.run(VertexManager.java:645)
>         at org.apache.tez.dag.app.dag.impl.VertexManager$VertexManagerEvent$1.run(VertexManager.java:640)
>         at java.security.AccessController.doPrivileged(Native Method)
>         at javax.security.auth.Subject.doAs(Subject.java:415)
>         at org.apache.hadoop.security.UserGroupInformation.doAs(UserGroupInformation.java:1628)
>         at org.apache.tez.dag.app.dag.impl.VertexManager$VertexManagerEvent.call(VertexManager.java:640)
>         at org.apache.tez.dag.app.dag.impl.VertexManager$VertexManagerEvent.call(VertexManager.java:629)
>         at java.util.concurrent.FutureTask.run(FutureTask.java:262)
>         at java.util.concurrent.ThreadPoolExecutor.runWorker(ThreadPoolExecutor.java:1145)
>         at java.util.concurrent.ThreadPoolExecutor$Worker.run(ThreadPoolExecutor.java:615)
>         at java.lang.Thread.run(Thread.java:745)
> Caused by: java.lang.RuntimeException: Failed to load plan: null: java.lang.IllegalArgumentException:
java.net.URISyntaxException: Relative path in absolute URI: subq1:amerge.xml
>         at org.apache.hadoop.hive.ql.exec.Utilities.getBaseWork(Utilities.java:451)
>         at org.apache.hadoop.hive.ql.exec.Utilities.getMergeWork(Utilities.java:339)
>         at org.apache.hadoop.hive.ql.exec.tez.SplitGrouper.populateMapWork(SplitGrouper.java:260)
>         at org.apache.hadoop.hive.ql.exec.tez.SplitGrouper.generateGroupedSplits(SplitGrouper.java:172)
>         at org.apache.hadoop.hive.ql.exec.tez.CustomPartitionVertex.onRootVertexInitialized(CustomPartitionVertex.java:277)
>         ... 12 more
> Caused by: java.lang.IllegalArgumentException: java.net.URISyntaxException: Relative
path in absolute URI: subq1:amerge.xml
>         at org.apache.hadoop.fs.Path.initialize(Path.java:206)
>         at org.apache.hadoop.fs.Path.<init>(Path.java:172)
>         at org.apache.hadoop.fs.Path.<init>(Path.java:94)
>         at org.apache.hadoop.hive.ql.exec.Utilities.getPlanPath(Utilities.java:588)
>         at org.apache.hadoop.hive.ql.exec.Utilities.getBaseWork(Utilities.java:387)
>         ... 16 more
> Caused by: java.net.URISyntaxException: Relative path in absolute URI: subq1:amerge.xml
>         at java.net.URI.checkPath(URI.java:1804)
>         at java.net.URI.<init>(URI.java:752)
>         at org.apache.hadoop.fs.Path.initialize(Path.java:203)
>         ... 20 more
> ]
> {code}



--
This message was sent by Atlassian JIRA
(v6.3.4#6332)

Mime
View raw message