hive-issues mailing list archives

Site index · List index
Message view « Date » · « Thread »
Top « Date » · « Thread »
From "Vihang Karajgaonkar (JIRA)" <j...@apache.org>
Subject [jira] [Resolved] (HIVE-14283) Beeline tests are broken
Date Tue, 19 Jul 2016 20:01:20 GMT

     [ https://issues.apache.org/jira/browse/HIVE-14283?page=com.atlassian.jira.plugin.system.issuetabpanels:all-tabpanel
]

Vihang Karajgaonkar resolved HIVE-14283.
----------------------------------------
    Resolution: Not A Bug

This was environment issue. Tests are working fine.

> Beeline tests are broken
> ------------------------
>
>                 Key: HIVE-14283
>                 URL: https://issues.apache.org/jira/browse/HIVE-14283
>             Project: Hive
>          Issue Type: Bug
>          Components: Beeline
>    Affects Versions: 2.2.0
>            Reporter: Vihang Karajgaonkar
>            Assignee: Vihang Karajgaonkar
>
> Beeline tests seems to be broken.
> {noformat}
> -------------------------------------------------------
>  T E S T S
> -------------------------------------------------------
> -------------------------------------------------------
>  T E S T S
> -------------------------------------------------------
> Running org.apache.hive.beeline.cli.TestHiveCli
> Tests run: 22, Failures: 22, Errors: 0, Skipped: 0, Time elapsed: 8.514 sec <<<
FAILURE! - in org.apache.hive.beeline.cli.TestHiveCli
> testSetPromptValue(org.apache.hive.beeline.cli.TestHiveCli)  Time elapsed: 1.599 sec
 <<< FAILURE!
> java.lang.AssertionError: Supported return code is 0 while the actual is 2
> 	at org.junit.Assert.fail(Assert.java:88)
> 	at org.apache.hive.beeline.cli.TestHiveCli.executeCMD(TestHiveCli.java:73)
> 	at org.apache.hive.beeline.cli.TestHiveCli.initFromFile(TestHiveCli.java:260)
> 	at org.apache.hive.beeline.cli.TestHiveCli.setup(TestHiveCli.java:283)
> testSourceCmd2(org.apache.hive.beeline.cli.TestHiveCli)  Time elapsed: 0.291 sec  <<<
FAILURE!
> java.lang.AssertionError: Supported return code is 0 while the actual is 2
> 	at org.junit.Assert.fail(Assert.java:88)
> 	at org.apache.hive.beeline.cli.TestHiveCli.executeCMD(TestHiveCli.java:73)
> 	at org.apache.hive.beeline.cli.TestHiveCli.initFromFile(TestHiveCli.java:260)
> 	at org.apache.hive.beeline.cli.TestHiveCli.setup(TestHiveCli.java:283)
> testSourceCmd3(org.apache.hive.beeline.cli.TestHiveCli)  Time elapsed: 0.306 sec  <<<
FAILURE!
> java.lang.AssertionError: Supported return code is 0 while the actual is 2
> 	at org.junit.Assert.fail(Assert.java:88)
> 	at org.apache.hive.beeline.cli.TestHiveCli.executeCMD(TestHiveCli.java:73)
> 	at org.apache.hive.beeline.cli.TestHiveCli.initFromFile(TestHiveCli.java:260)
> 	at org.apache.hive.beeline.cli.TestHiveCli.setup(TestHiveCli.java:283)
> testInvalidOptions2(org.apache.hive.beeline.cli.TestHiveCli)  Time elapsed: 0.292 sec
 <<< FAILURE!
> java.lang.AssertionError: Supported return code is 0 while the actual is 2
> 	at org.junit.Assert.fail(Assert.java:88)
> 	at org.apache.hive.beeline.cli.TestHiveCli.executeCMD(TestHiveCli.java:73)
> 	at org.apache.hive.beeline.cli.TestHiveCli.initFromFile(TestHiveCli.java:260)
> 	at org.apache.hive.beeline.cli.TestHiveCli.setup(TestHiveCli.java:283)
> testCmd(org.apache.hive.beeline.cli.TestHiveCli)  Time elapsed: 0.271 sec  <<<
FAILURE!
> java.lang.AssertionError: Supported return code is 0 while the actual is 2
> 	at org.junit.Assert.fail(Assert.java:88)
> 	at org.apache.hive.beeline.cli.TestHiveCli.executeCMD(TestHiveCli.java:73)
> 	at org.apache.hive.beeline.cli.TestHiveCli.initFromFile(TestHiveCli.java:260)
> 	at org.apache.hive.beeline.cli.TestHiveCli.setup(TestHiveCli.java:283)
> testHelp(org.apache.hive.beeline.cli.TestHiveCli)  Time elapsed: 0.284 sec  <<<
FAILURE!
> java.lang.AssertionError: Supported return code is 0 while the actual is 2
> 	at org.junit.Assert.fail(Assert.java:88)
> 	at org.apache.hive.beeline.cli.TestHiveCli.executeCMD(TestHiveCli.java:73)
> 	at org.apache.hive.beeline.cli.TestHiveCli.initFromFile(TestHiveCli.java:260)
> 	at org.apache.hive.beeline.cli.TestHiveCli.setup(TestHiveCli.java:283)
> testSourceCmd(org.apache.hive.beeline.cli.TestHiveCli)  Time elapsed: 0.259 sec  <<<
FAILURE!
> java.lang.AssertionError: Supported return code is 0 while the actual is 2
> 	at org.junit.Assert.fail(Assert.java:88)
> 	at org.apache.hive.beeline.cli.TestHiveCli.executeCMD(TestHiveCli.java:73)
> 	at org.apache.hive.beeline.cli.TestHiveCli.initFromFile(TestHiveCli.java:260)
> 	at org.apache.hive.beeline.cli.TestHiveCli.setup(TestHiveCli.java:283)
> testSqlFromCmdWithDBName(org.apache.hive.beeline.cli.TestHiveCli)  Time elapsed: 0.214
sec  <<< FAILURE!
> java.lang.AssertionError: Supported return code is 0 while the actual is 2
> 	at org.junit.Assert.fail(Assert.java:88)
> 	at org.apache.hive.beeline.cli.TestHiveCli.executeCMD(TestHiveCli.java:73)
> 	at org.apache.hive.beeline.cli.TestHiveCli.initFromFile(TestHiveCli.java:260)
> 	at org.apache.hive.beeline.cli.TestHiveCli.setup(TestHiveCli.java:283)
> testUseCurrentDB1(org.apache.hive.beeline.cli.TestHiveCli)  Time elapsed: 0.23 sec  <<<
FAILURE!
> java.lang.AssertionError: Supported return code is 0 while the actual is 2
> 	at org.junit.Assert.fail(Assert.java:88)
> 	at org.apache.hive.beeline.cli.TestHiveCli.executeCMD(TestHiveCli.java:73)
> 	at org.apache.hive.beeline.cli.TestHiveCli.initFromFile(TestHiveCli.java:260)
> 	at org.apache.hive.beeline.cli.TestHiveCli.setup(TestHiveCli.java:283)
> testUseCurrentDB2(org.apache.hive.beeline.cli.TestHiveCli)  Time elapsed: 0.212 sec 
<<< FAILURE!
> java.lang.AssertionError: Supported return code is 0 while the actual is 2
> 	at org.junit.Assert.fail(Assert.java:88)
> 	at org.apache.hive.beeline.cli.TestHiveCli.executeCMD(TestHiveCli.java:73)
> 	at org.apache.hive.beeline.cli.TestHiveCli.initFromFile(TestHiveCli.java:260)
> 	at org.apache.hive.beeline.cli.TestHiveCli.setup(TestHiveCli.java:283)
> testUseCurrentDB3(org.apache.hive.beeline.cli.TestHiveCli)  Time elapsed: 0.22 sec  <<<
FAILURE!
> java.lang.AssertionError: Supported return code is 0 while the actual is 2
> 	at org.junit.Assert.fail(Assert.java:88)
> 	at org.apache.hive.beeline.cli.TestHiveCli.executeCMD(TestHiveCli.java:73)
> 	at org.apache.hive.beeline.cli.TestHiveCli.initFromFile(TestHiveCli.java:260)
> 	at org.apache.hive.beeline.cli.TestHiveCli.setup(TestHiveCli.java:283)
> testDatabaseOptions(org.apache.hive.beeline.cli.TestHiveCli)  Time elapsed: 0.236 sec
 <<< FAILURE!
> java.lang.AssertionError: Supported return code is 0 while the actual is 2
> 	at org.junit.Assert.fail(Assert.java:88)
> 	at org.apache.hive.beeline.cli.TestHiveCli.executeCMD(TestHiveCli.java:73)
> 	at org.apache.hive.beeline.cli.TestHiveCli.initFromFile(TestHiveCli.java:260)
> 	at org.apache.hive.beeline.cli.TestHiveCli.setup(TestHiveCli.java:283)
> testNoErrorDB(org.apache.hive.beeline.cli.TestHiveCli)  Time elapsed: 0.259 sec  <<<
FAILURE!
> java.lang.AssertionError: Supported return code is 0 while the actual is 2
> 	at org.junit.Assert.fail(Assert.java:88)
> 	at org.apache.hive.beeline.cli.TestHiveCli.executeCMD(TestHiveCli.java:73)
> 	at org.apache.hive.beeline.cli.TestHiveCli.initFromFile(TestHiveCli.java:260)
> 	at org.apache.hive.beeline.cli.TestHiveCli.setup(TestHiveCli.java:283)
> testUseInvalidDB(org.apache.hive.beeline.cli.TestHiveCli)  Time elapsed: 0.266 sec  <<<
FAILURE!
> java.lang.AssertionError: Supported return code is 0 while the actual is 2
> 	at org.junit.Assert.fail(Assert.java:88)
> 	at org.apache.hive.beeline.cli.TestHiveCli.executeCMD(TestHiveCli.java:73)
> 	at org.apache.hive.beeline.cli.TestHiveCli.initFromFile(TestHiveCli.java:260)
> 	at org.apache.hive.beeline.cli.TestHiveCli.setup(TestHiveCli.java:283)
> testErrOutput(org.apache.hive.beeline.cli.TestHiveCli)  Time elapsed: 0.2 sec  <<<
FAILURE!
> java.lang.AssertionError: Supported return code is 0 while the actual is 2
> 	at org.junit.Assert.fail(Assert.java:88)
> 	at org.apache.hive.beeline.cli.TestHiveCli.executeCMD(TestHiveCli.java:73)
> 	at org.apache.hive.beeline.cli.TestHiveCli.initFromFile(TestHiveCli.java:260)
> 	at org.apache.hive.beeline.cli.TestHiveCli.setup(TestHiveCli.java:283)
> testSqlFromCmd(org.apache.hive.beeline.cli.TestHiveCli)  Time elapsed: 0.209 sec  <<<
FAILURE!
> java.lang.AssertionError: Supported return code is 0 while the actual is 2
> 	at org.junit.Assert.fail(Assert.java:88)
> 	at org.apache.hive.beeline.cli.TestHiveCli.executeCMD(TestHiveCli.java:73)
> 	at org.apache.hive.beeline.cli.TestHiveCli.initFromFile(TestHiveCli.java:260)
> 	at org.apache.hive.beeline.cli.TestHiveCli.setup(TestHiveCli.java:283)
> testInvalidDatabaseOptions(org.apache.hive.beeline.cli.TestHiveCli)  Time elapsed: 0.205
sec  <<< FAILURE!
> java.lang.AssertionError: Supported return code is 0 while the actual is 2
> 	at org.junit.Assert.fail(Assert.java:88)
> 	at org.apache.hive.beeline.cli.TestHiveCli.executeCMD(TestHiveCli.java:73)
> 	at org.apache.hive.beeline.cli.TestHiveCli.initFromFile(TestHiveCli.java:260)
> 	at org.apache.hive.beeline.cli.TestHiveCli.setup(TestHiveCli.java:283)
> testVariables(org.apache.hive.beeline.cli.TestHiveCli)  Time elapsed: 0.198 sec  <<<
FAILURE!
> java.lang.AssertionError: Supported return code is 0 while the actual is 2
> 	at org.junit.Assert.fail(Assert.java:88)
> 	at org.apache.hive.beeline.cli.TestHiveCli.executeCMD(TestHiveCli.java:73)
> 	at org.apache.hive.beeline.cli.TestHiveCli.initFromFile(TestHiveCli.java:260)
> 	at org.apache.hive.beeline.cli.TestHiveCli.setup(TestHiveCli.java:283)
> testInvalidOptions(org.apache.hive.beeline.cli.TestHiveCli)  Time elapsed: 0.209 sec
 <<< FAILURE!
> java.lang.AssertionError: Supported return code is 0 while the actual is 2
> 	at org.junit.Assert.fail(Assert.java:88)
> 	at org.apache.hive.beeline.cli.TestHiveCli.executeCMD(TestHiveCli.java:73)
> 	at org.apache.hive.beeline.cli.TestHiveCli.initFromFile(TestHiveCli.java:260)
> 	at org.apache.hive.beeline.cli.TestHiveCli.setup(TestHiveCli.java:283)
> testVariablesForSource(org.apache.hive.beeline.cli.TestHiveCli)  Time elapsed: 0.195
sec  <<< FAILURE!
> java.lang.AssertionError: Supported return code is 0 while the actual is 2
> 	at org.junit.Assert.fail(Assert.java:88)
> 	at org.apache.hive.beeline.cli.TestHiveCli.executeCMD(TestHiveCli.java:73)
> 	at org.apache.hive.beeline.cli.TestHiveCli.initFromFile(TestHiveCli.java:260)
> 	at org.apache.hive.beeline.cli.TestHiveCli.setup(TestHiveCli.java:283)
> testSetHeaderValue(org.apache.hive.beeline.cli.TestHiveCli)  Time elapsed: 0.191 sec
 <<< FAILURE!
> java.lang.AssertionError: Supported return code is 0 while the actual is 2
> 	at org.junit.Assert.fail(Assert.java:88)
> 	at org.apache.hive.beeline.cli.TestHiveCli.executeCMD(TestHiveCli.java:73)
> 	at org.apache.hive.beeline.cli.TestHiveCli.initFromFile(TestHiveCli.java:260)
> 	at org.apache.hive.beeline.cli.TestHiveCli.setup(TestHiveCli.java:283)
> testInValidCmd(org.apache.hive.beeline.cli.TestHiveCli)  Time elapsed: 0.197 sec  <<<
FAILURE!
> java.lang.AssertionError: Supported return code is 0 while the actual is 2
> 	at org.junit.Assert.fail(Assert.java:88)
> 	at org.apache.hive.beeline.cli.TestHiveCli.executeCMD(TestHiveCli.java:73)
> 	at org.apache.hive.beeline.cli.TestHiveCli.initFromFile(TestHiveCli.java:260)
> 	at org.apache.hive.beeline.cli.TestHiveCli.setup(TestHiveCli.java:283)
> Running org.apache.hive.beeline.TestBeelineArgParsing
> Tests run: 28, Failures: 0, Errors: 0, Skipped: 0, Time elapsed: 2.612 sec - in org.apache.hive.beeline.TestBeelineArgParsing
> Running org.apache.hive.beeline.TestBeeLineHistory
> Tests run: 2, Failures: 0, Errors: 0, Skipped: 0, Time elapsed: 0.193 sec - in org.apache.hive.beeline.TestBeeLineHistory
> Running org.apache.hive.beeline.TestBufferedRows
> Tests run: 1, Failures: 0, Errors: 0, Skipped: 0, Time elapsed: 0.415 sec - in org.apache.hive.beeline.TestBufferedRows
> Running org.apache.hive.beeline.TestClientCommandHookFactory
> Tests run: 1, Failures: 0, Errors: 0, Skipped: 0, Time elapsed: 0.074 sec - in org.apache.hive.beeline.TestClientCommandHookFactory
> Results :
> Failed tests:
>   TestHiveCli.setup:283->initFromFile:260->executeCMD:73 Supported return code
is 0 while the actual is 2
>   TestHiveCli.setup:283->initFromFile:260->executeCMD:73 Supported return code
is 0 while the actual is 2
>   TestHiveCli.setup:283->initFromFile:260->executeCMD:73 Supported return code
is 0 while the actual is 2
>   TestHiveCli.setup:283->initFromFile:260->executeCMD:73 Supported return code
is 0 while the actual is 2
>   TestHiveCli.setup:283->initFromFile:260->executeCMD:73 Supported return code
is 0 while the actual is 2
>   TestHiveCli.setup:283->initFromFile:260->executeCMD:73 Supported return code
is 0 while the actual is 2
>   TestHiveCli.setup:283->initFromFile:260->executeCMD:73 Supported return code
is 0 while the actual is 2
>   TestHiveCli.setup:283->initFromFile:260->executeCMD:73 Supported return code
is 0 while the actual is 2
>   TestHiveCli.setup:283->initFromFile:260->executeCMD:73 Supported return code
is 0 while the actual is 2
>   TestHiveCli.setup:283->initFromFile:260->executeCMD:73 Supported return code
is 0 while the actual is 2
>   TestHiveCli.setup:283->initFromFile:260->executeCMD:73 Supported return code
is 0 while the actual is 2
>   TestHiveCli.setup:283->initFromFile:260->executeCMD:73 Supported return code
is 0 while the actual is 2
>   TestHiveCli.setup:283->initFromFile:260->executeCMD:73 Supported return code
is 0 while the actual is 2
>   TestHiveCli.setup:283->initFromFile:260->executeCMD:73 Supported return code
is 0 while the actual is 2
>   TestHiveCli.setup:283->initFromFile:260->executeCMD:73 Supported return code
is 0 while the actual is 2
>   TestHiveCli.setup:283->initFromFile:260->executeCMD:73 Supported return code
is 0 while the actual is 2
>   TestHiveCli.setup:283->initFromFile:260->executeCMD:73 Supported return code
is 0 while the actual is 2
>   TestHiveCli.setup:283->initFromFile:260->executeCMD:73 Supported return code
is 0 while the actual is 2
>   TestHiveCli.setup:283->initFromFile:260->executeCMD:73 Supported return code
is 0 while the actual is 2
>   TestHiveCli.setup:283->initFromFile:260->executeCMD:73 Supported return code
is 0 while the actual is 2
>   TestHiveCli.setup:283->initFromFile:260->executeCMD:73 Supported return code
is 0 while the actual is 2
>   TestHiveCli.setup:283->initFromFile:260->executeCMD:73 Supported return code
is 0 while the actual is 2
> Tests run: 54, Failures: 22, Errors: 0, Skipped: 0
> {noformat}



--
This message was sent by Atlassian JIRA
(v6.3.4#6332)

Mime
View raw message