hive-issues mailing list archives

Site index · List index
Message view « Date » · « Thread »
Top « Date » · « Thread »
From "Hive QA (JIRA)" <j...@apache.org>
Subject [jira] [Commented] (HIVE-13682) EOFException with fast hashtable
Date Sat, 14 May 2016 11:19:12 GMT

    [ https://issues.apache.org/jira/browse/HIVE-13682?page=com.atlassian.jira.plugin.system.issuetabpanels:comment-tabpanel&focusedCommentId=15283525#comment-15283525
] 

Hive QA commented on HIVE-13682:
--------------------------------



Here are the results of testing the latest attachment:
https://issues.apache.org/jira/secure/attachment/12804011/HIVE-13682.01.patch

{color:green}SUCCESS:{color} +1 due to 12 test(s) being added or modified.

{color:red}ERROR:{color} -1 due to 79 failed/errored test(s), 9239 tests executed
*Failed tests:*
{noformat}
TestHWISessionManager - did not produce a TEST-*.xml file
TestMiniLlapCliDriver - did not produce a TEST-*.xml file
TestMiniTezCliDriver-dynpart_sort_optimization2.q-tez_dynpart_hashjoin_3.q-orc_vectorization_ppd.q-and-12-more
- did not produce a TEST-*.xml file
TestMiniTezCliDriver-join1.q-mapjoin_decimal.q-union5.q-and-12-more - did not produce a TEST-*.xml
file
TestMiniTezCliDriver-vectorized_parquet.q-insert_values_non_partitioned.q-schema_evol_orc_nonvec_mapwork_part.q-and-12-more
- did not produce a TEST-*.xml file
TestNegativeCliDriver-udf_invalid.q-nopart_insert.q-insert_into_with_schema.q-and-734-more
- did not produce a TEST-*.xml file
TestSparkCliDriver-groupby3_map.q-skewjoinopt8.q-union_remove_1.q-and-12-more - did not produce
a TEST-*.xml file
TestSparkCliDriver-mapreduce2.q-groupby7_noskew.q-vectorization_5.q-and-12-more - did not
produce a TEST-*.xml file
TestSparkCliDriver-ptf_rcfile.q-bucketmapjoin_negative.q-bucket_map_join_spark2.q-and-12-more
- did not produce a TEST-*.xml file
org.apache.hadoop.hive.cli.TestCliDriver.testCliDriver_ivyDownload
org.apache.hadoop.hive.cli.TestMiniSparkOnYarnCliDriver.testCliDriver_bucket4
org.apache.hadoop.hive.cli.TestMiniSparkOnYarnCliDriver.testCliDriver_bucket5
org.apache.hadoop.hive.cli.TestMiniSparkOnYarnCliDriver.testCliDriver_bucket6
org.apache.hadoop.hive.cli.TestMiniSparkOnYarnCliDriver.testCliDriver_disable_merge_for_bucketing
org.apache.hadoop.hive.cli.TestMiniSparkOnYarnCliDriver.testCliDriver_index_bitmap3
org.apache.hadoop.hive.cli.TestMiniSparkOnYarnCliDriver.testCliDriver_infer_bucket_sort_map_operators
org.apache.hadoop.hive.cli.TestMiniSparkOnYarnCliDriver.testCliDriver_infer_bucket_sort_num_buckets
org.apache.hadoop.hive.cli.TestMiniSparkOnYarnCliDriver.testCliDriver_infer_bucket_sort_reducers_power_two
org.apache.hadoop.hive.cli.TestMiniSparkOnYarnCliDriver.testCliDriver_list_bucket_dml_10
org.apache.hadoop.hive.cli.TestMiniSparkOnYarnCliDriver.testCliDriver_orc_merge1
org.apache.hadoop.hive.cli.TestMiniSparkOnYarnCliDriver.testCliDriver_orc_merge2
org.apache.hadoop.hive.cli.TestMiniSparkOnYarnCliDriver.testCliDriver_orc_merge9
org.apache.hadoop.hive.cli.TestMiniSparkOnYarnCliDriver.testCliDriver_orc_merge_diff_fs
org.apache.hadoop.hive.cli.TestMiniSparkOnYarnCliDriver.testCliDriver_reduce_deduplicate
org.apache.hadoop.hive.cli.TestMiniSparkOnYarnCliDriver.testCliDriver_vector_outer_join1
org.apache.hadoop.hive.cli.TestMiniSparkOnYarnCliDriver.testCliDriver_vector_outer_join2
org.apache.hadoop.hive.cli.TestMiniSparkOnYarnCliDriver.testCliDriver_vector_outer_join3
org.apache.hadoop.hive.cli.TestMiniSparkOnYarnCliDriver.testCliDriver_vector_outer_join4
org.apache.hadoop.hive.cli.TestMiniSparkOnYarnCliDriver.testCliDriver_vector_outer_join5
org.apache.hadoop.hive.cli.TestSparkCliDriver.testCliDriver_auto_join19
org.apache.hadoop.hive.cli.TestSparkCliDriver.testCliDriver_auto_join22
org.apache.hadoop.hive.cli.TestSparkCliDriver.testCliDriver_auto_join23
org.apache.hadoop.hive.cli.TestSparkCliDriver.testCliDriver_auto_join30
org.apache.hadoop.hive.cli.TestSparkCliDriver.testCliDriver_groupby1_map_nomap
org.apache.hadoop.hive.cli.TestSparkCliDriver.testCliDriver_groupby3_noskew
org.apache.hadoop.hive.cli.TestSparkCliDriver.testCliDriver_groupby_complex_types_multi_single_reducer
org.apache.hadoop.hive.cli.TestSparkCliDriver.testCliDriver_input17
org.apache.hadoop.hive.cli.TestSparkCliDriver.testCliDriver_insert_into2
org.apache.hadoop.hive.cli.TestSparkCliDriver.testCliDriver_join12
org.apache.hadoop.hive.cli.TestSparkCliDriver.testCliDriver_join2
org.apache.hadoop.hive.cli.TestSparkCliDriver.testCliDriver_join23
org.apache.hadoop.hive.cli.TestSparkCliDriver.testCliDriver_join_cond_pushdown_unqual1
org.apache.hadoop.hive.cli.TestSparkCliDriver.testCliDriver_load_dyn_part8
org.apache.hadoop.hive.cli.TestSparkCliDriver.testCliDriver_louter_join_ppr
org.apache.hadoop.hive.cli.TestSparkCliDriver.testCliDriver_nullgroup4_multi_distinct
org.apache.hadoop.hive.cli.TestSparkCliDriver.testCliDriver_ppd_outer_join2
org.apache.hadoop.hive.cli.TestSparkCliDriver.testCliDriver_union25
org.apache.hadoop.hive.cli.TestSparkCliDriver.testCliDriver_union29
org.apache.hadoop.hive.cli.TestSparkCliDriver.testCliDriver_vectorized_case
org.apache.hadoop.hive.llap.tez.TestConverters.testFragmentSpecToTaskSpec
org.apache.hadoop.hive.llap.tezplugins.TestLlapTaskCommunicator.testFinishableStateUpdateFailure
org.apache.hadoop.hive.metastore.TestAuthzApiEmbedAuthorizerInRemote.org.apache.hadoop.hive.metastore.TestAuthzApiEmbedAuthorizerInRemote
org.apache.hadoop.hive.metastore.TestFilterHooks.org.apache.hadoop.hive.metastore.TestFilterHooks
org.apache.hadoop.hive.metastore.TestHiveMetaStoreGetMetaConf.org.apache.hadoop.hive.metastore.TestHiveMetaStoreGetMetaConf
org.apache.hadoop.hive.metastore.TestHiveMetaStorePartitionSpecs.org.apache.hadoop.hive.metastore.TestHiveMetaStorePartitionSpecs
org.apache.hadoop.hive.metastore.TestMetaStoreEndFunctionListener.testEndFunctionListener
org.apache.hadoop.hive.metastore.TestMetaStoreInitListener.testMetaStoreInitListener
org.apache.hadoop.hive.metastore.TestMetaStoreMetrics.org.apache.hadoop.hive.metastore.TestMetaStoreMetrics
org.apache.hadoop.hive.metastore.TestPartitionNameWhitelistValidation.testAddPartitionWithCommas
org.apache.hadoop.hive.metastore.TestPartitionNameWhitelistValidation.testAddPartitionWithUnicode
org.apache.hadoop.hive.metastore.TestPartitionNameWhitelistValidation.testAddPartitionWithValidPartVal
org.apache.hadoop.hive.metastore.TestPartitionNameWhitelistValidation.testAppendPartitionWithCommas
org.apache.hadoop.hive.metastore.TestPartitionNameWhitelistValidation.testAppendPartitionWithUnicode
org.apache.hadoop.hive.metastore.TestPartitionNameWhitelistValidation.testAppendPartitionWithValidCharacters
org.apache.hadoop.hive.ql.security.TestExtendedAcls.org.apache.hadoop.hive.ql.security.TestExtendedAcls
org.apache.hadoop.hive.ql.security.TestStorageBasedClientSideAuthorizationProvider.testSimplePrivileges
org.apache.hadoop.hive.ql.security.TestStorageBasedMetastoreAuthorizationDrops.testDropPartition
org.apache.hadoop.hive.ql.security.TestStorageBasedMetastoreAuthorizationProvider.testSimplePrivileges
org.apache.hadoop.hive.ql.security.TestStorageBasedMetastoreAuthorizationProviderWithACL.testSimplePrivileges
org.apache.hive.hcatalog.hbase.TestPigHBaseStorageHandler.org.apache.hive.hcatalog.hbase.TestPigHBaseStorageHandler
org.apache.hive.minikdc.TestJdbcWithDBTokenStore.testConnection
org.apache.hive.minikdc.TestJdbcWithDBTokenStore.testIsValid
org.apache.hive.minikdc.TestJdbcWithDBTokenStore.testIsValidNeg
org.apache.hive.minikdc.TestJdbcWithDBTokenStore.testNegativeProxyAuth
org.apache.hive.minikdc.TestJdbcWithDBTokenStore.testNegativeTokenAuth
org.apache.hive.minikdc.TestJdbcWithDBTokenStore.testProxyAuth
org.apache.hive.minikdc.TestJdbcWithDBTokenStore.testTokenAuth
org.apache.hive.service.cli.session.TestHiveSessionImpl.testLeakOperationHandle
org.apache.hive.spark.client.TestSparkClient.testSyncRpc
{noformat}

Test results: http://ec2-54-177-240-2.us-west-1.compute.amazonaws.com/job/PreCommit-HIVE-MASTER-Build/267/testReport
Console output: http://ec2-54-177-240-2.us-west-1.compute.amazonaws.com/job/PreCommit-HIVE-MASTER-Build/267/console
Test logs: http://ec2-50-18-27-0.us-west-1.compute.amazonaws.com/logs/PreCommit-HIVE-MASTER-Build-267/

Messages:
{noformat}
Executing org.apache.hive.ptest.execution.TestCheckPhase
Executing org.apache.hive.ptest.execution.PrepPhase
Executing org.apache.hive.ptest.execution.ExecutionPhase
Executing org.apache.hive.ptest.execution.ReportingPhase
Tests exited with: TestsFailedException: 79 tests failed
{noformat}

This message is automatically generated.

ATTACHMENT ID: 12804011 - PreCommit-HIVE-MASTER-Build

> EOFException with fast hashtable
> --------------------------------
>
>                 Key: HIVE-13682
>                 URL: https://issues.apache.org/jira/browse/HIVE-13682
>             Project: Hive
>          Issue Type: Bug
>            Reporter: Sergey Shelukhin
>            Assignee: Matt McCline
>         Attachments: HIVE-13682.01.patch
>
>
> While testing something else on recent master, w/Tez 0.8.3, this happened (TPCDS q27)
> {noformat}
> Caused by: java.util.concurrent.ExecutionException: org.apache.hadoop.hive.ql.metadata.HiveException:
org.apache.hadoop.hive.ql.metadata.HiveException: java.io.EOFException
> 	at java.util.concurrent.FutureTask.report(FutureTask.java:122)
> 	at java.util.concurrent.FutureTask.get(FutureTask.java:192)
> 	at org.apache.hadoop.hive.ql.exec.Operator.completeInitialization(Operator.java:399)
> 	... 20 more
> Caused by: org.apache.hadoop.hive.ql.metadata.HiveException: org.apache.hadoop.hive.ql.metadata.HiveException:
java.io.EOFException
> 	at org.apache.hadoop.hive.ql.exec.tez.LlapObjectCache.retrieve(LlapObjectCache.java:106)
> 	at org.apache.hadoop.hive.ql.exec.tez.LlapObjectCache$1.call(LlapObjectCache.java:131)
> 	... 4 more
> Caused by: org.apache.hadoop.hive.ql.metadata.HiveException: java.io.EOFException
> 	at org.apache.hadoop.hive.ql.exec.vector.mapjoin.fast.VectorMapJoinFastHashTableLoader.load(VectorMapJoinFastHashTableLoader.java:106)
> 	at org.apache.hadoop.hive.ql.exec.MapJoinOperator.loadHashTable(MapJoinOperator.java:304)
> 	at org.apache.hadoop.hive.ql.exec.MapJoinOperator$1.call(MapJoinOperator.java:185)
> 	at org.apache.hadoop.hive.ql.exec.MapJoinOperator$1.call(MapJoinOperator.java:181)
> 	at org.apache.hadoop.hive.ql.exec.tez.LlapObjectCache.retrieve(LlapObjectCache.java:104)
> 	... 5 more
> Caused by: java.io.EOFException
> 	at org.apache.hadoop.hive.serde2.binarysortable.InputByteBuffer.read(InputByteBuffer.java:54)
> 	at org.apache.hadoop.hive.serde2.binarysortable.fast.BinarySortableDeserializeRead.readCheckNull(BinarySortableDeserializeRead.java:182)
> 	at org.apache.hadoop.hive.ql.exec.vector.mapjoin.fast.VectorMapJoinFastLongHashTable.putRow(VectorMapJoinFastLongHashTable.java:83)
> 	at org.apache.hadoop.hive.ql.exec.vector.mapjoin.fast.VectorMapJoinFastTableContainer.putRow(VectorMapJoinFastTableContainer.java:181)
> 	at org.apache.hadoop.hive.ql.exec.vector.mapjoin.fast.VectorMapJoinFastHashTableLoader.load(VectorMapJoinFastHashTableLoader.java:98)
> 	... 9 more
> {noformat}
> There's no error if fast hashtable is disabled.



--
This message was sent by Atlassian JIRA
(v6.3.4#6332)

Mime
View raw message