hive-issues mailing list archives

Site index · List index
Message view « Date » · « Thread »
Top « Date » · « Thread »
From "Hive QA (JIRA)" <j...@apache.org>
Subject [jira] [Commented] (HIVE-13443) LLAP: signing for the second state of submit (the event)
Date Fri, 20 May 2016 00:55:13 GMT

    [ https://issues.apache.org/jira/browse/HIVE-13443?page=com.atlassian.jira.plugin.system.issuetabpanels:comment-tabpanel&focusedCommentId=15292482#comment-15292482
] 

Hive QA commented on HIVE-13443:
--------------------------------



Here are the results of testing the latest attachment:
https://issues.apache.org/jira/secure/attachment/12804821/HIVE-13443.patch

{color:red}ERROR:{color} -1 due to build exiting with an error

Test results: http://ec2-54-177-240-2.us-west-1.compute.amazonaws.com/job/PreCommit-HIVE-MASTER-Build/330/testReport
Console output: http://ec2-54-177-240-2.us-west-1.compute.amazonaws.com/job/PreCommit-HIVE-MASTER-Build/330/console
Test logs: http://ec2-50-18-27-0.us-west-1.compute.amazonaws.com/logs/PreCommit-HIVE-MASTER-Build-330/

Messages:
{noformat}
**** This message was trimmed, see log for full details ****
[INFO] Building Hive Integration - Testing Utilities 2.1.0-SNAPSHOT
[INFO] ------------------------------------------------------------------------
[INFO] 
[INFO] --- maven-clean-plugin:2.5:clean (default-clean) @ hive-it-util ---
[INFO] Deleting /data/hive-ptest/working/apache-github-source-source/itests/util/target
[INFO] Deleting /data/hive-ptest/working/apache-github-source-source/itests/util (includes
= [datanucleus.log, derby.log], excludes = [])
[INFO] 
[INFO] --- maven-enforcer-plugin:1.3.1:enforce (enforce-no-snapshots) @ hive-it-util ---
[INFO] 
[INFO] --- maven-antrun-plugin:1.7:run (download-spark) @ hive-it-util ---
[INFO] Executing tasks

main:
[INFO] Executed tasks
[INFO] 
[INFO] --- maven-remote-resources-plugin:1.5:process (default) @ hive-it-util ---
[INFO] 
[INFO] --- maven-resources-plugin:2.6:resources (default-resources) @ hive-it-util ---
[INFO] Using 'UTF-8' encoding to copy filtered resources.
[INFO] skip non existing resourceDirectory /data/hive-ptest/working/apache-github-source-source/itests/util/src/main/resources
[INFO] Copying 3 resources
[INFO] 
[INFO] --- maven-antrun-plugin:1.7:run (define-classpath) @ hive-it-util ---
[INFO] Executing tasks

main:
[INFO] Executed tasks
[INFO] 
[INFO] --- maven-compiler-plugin:3.1:compile (default-compile) @ hive-it-util ---
[INFO] Compiling 52 source files to /data/hive-ptest/working/apache-github-source-source/itests/util/target/classes
[WARNING] /data/hive-ptest/working/apache-github-source-source/itests/util/src/main/java/org/apache/hadoop/hive/hbase/HBaseQTestUtil.java:
Some input files use or override a deprecated API.
[WARNING] /data/hive-ptest/working/apache-github-source-source/itests/util/src/main/java/org/apache/hadoop/hive/hbase/HBaseQTestUtil.java:
Recompile with -Xlint:deprecation for details.
[INFO] 
[INFO] --- maven-resources-plugin:2.6:testResources (default-testResources) @ hive-it-util
---
[INFO] Using 'UTF-8' encoding to copy filtered resources.
[INFO] skip non existing resourceDirectory /data/hive-ptest/working/apache-github-source-source/itests/util/src/test/resources
[INFO] Copying 3 resources
[INFO] 
[INFO] --- maven-antrun-plugin:1.7:run (setup-test-dirs) @ hive-it-util ---
[INFO] Executing tasks

main:
    [mkdir] Created dir: /data/hive-ptest/working/apache-github-source-source/itests/util/target/tmp
    [mkdir] Created dir: /data/hive-ptest/working/apache-github-source-source/itests/util/target/warehouse
    [mkdir] Created dir: /data/hive-ptest/working/apache-github-source-source/itests/util/target/tmp/conf
     [copy] Copying 15 files to /data/hive-ptest/working/apache-github-source-source/itests/util/target/tmp/conf
[INFO] Executed tasks
[INFO] 
[INFO] --- maven-compiler-plugin:3.1:testCompile (default-testCompile) @ hive-it-util ---
[INFO] No sources to compile
[INFO] 
[INFO] --- maven-surefire-plugin:2.16:test (default-test) @ hive-it-util ---
[INFO] Tests are skipped.
[INFO] 
[INFO] --- maven-jar-plugin:2.2:jar (default-jar) @ hive-it-util ---
[INFO] Building jar: /data/hive-ptest/working/apache-github-source-source/itests/util/target/hive-it-util-2.1.0-SNAPSHOT.jar
[INFO] 
[INFO] --- maven-site-plugin:3.3:attach-descriptor (attach-descriptor) @ hive-it-util ---
[INFO] 
[INFO] --- maven-install-plugin:2.4:install (default-install) @ hive-it-util ---
[INFO] Installing /data/hive-ptest/working/apache-github-source-source/itests/util/target/hive-it-util-2.1.0-SNAPSHOT.jar
to /home/hiveptest/.m2/repository/org/apache/hive/hive-it-util/2.1.0-SNAPSHOT/hive-it-util-2.1.0-SNAPSHOT.jar
[INFO] Installing /data/hive-ptest/working/apache-github-source-source/itests/util/pom.xml
to /home/hiveptest/.m2/repository/org/apache/hive/hive-it-util/2.1.0-SNAPSHOT/hive-it-util-2.1.0-SNAPSHOT.pom
[INFO]                                                                         
[INFO] ------------------------------------------------------------------------
[INFO] Building Hive Integration - Unit Tests 2.1.0-SNAPSHOT
[INFO] ------------------------------------------------------------------------
[INFO] 
[INFO] --- maven-clean-plugin:2.5:clean (default-clean) @ hive-it-unit ---
[INFO] Deleting /data/hive-ptest/working/apache-github-source-source/itests/hive-unit/target
[INFO] Deleting /data/hive-ptest/working/apache-github-source-source/itests/hive-unit (includes
= [datanucleus.log, derby.log], excludes = [])
[INFO] 
[INFO] --- maven-enforcer-plugin:1.3.1:enforce (enforce-no-snapshots) @ hive-it-unit ---
[INFO] 
[INFO] --- maven-antrun-plugin:1.7:run (download-spark) @ hive-it-unit ---
[INFO] Executing tasks

main:
     [exec] + /bin/pwd
     [exec] + BASE_DIR=./target
     [exec] + HIVE_ROOT=./target/../../../
     [exec] + DOWNLOAD_DIR=./../thirdparty
     [exec] + mkdir -p ./../thirdparty
     [exec] /data/hive-ptest/working/apache-github-source-source/itests/hive-unit
     [exec] + download http://d3jw87u4immizc.cloudfront.net/spark-tarball/spark-1.6.0-bin-hadoop2-without-hive.tgz
spark
     [exec] + url=http://d3jw87u4immizc.cloudfront.net/spark-tarball/spark-1.6.0-bin-hadoop2-without-hive.tgz
     [exec] + finalName=spark
     [exec] ++ basename http://d3jw87u4immizc.cloudfront.net/spark-tarball/spark-1.6.0-bin-hadoop2-without-hive.tgz
     [exec] + tarName=spark-1.6.0-bin-hadoop2-without-hive.tgz
     [exec] + rm -rf ./target/spark
     [exec] + [[ ! -f ./../thirdparty/spark-1.6.0-bin-hadoop2-without-hive.tgz ]]
     [exec] + tar -zxf ./../thirdparty/spark-1.6.0-bin-hadoop2-without-hive.tgz -C ./target
     [exec] + mv ./target/spark-1.6.0-bin-hadoop2-without-hive ./target/spark
     [exec] + cp -f ./target/../../..//data/conf/spark/log4j2.properties ./target/spark/conf/
[INFO] Executed tasks
[INFO] 
[INFO] --- maven-remote-resources-plugin:1.5:process (default) @ hive-it-unit ---
[INFO] 
[INFO] --- maven-resources-plugin:2.6:resources (default-resources) @ hive-it-unit ---
[INFO] Using 'UTF-8' encoding to copy filtered resources.
[INFO] skip non existing resourceDirectory /data/hive-ptest/working/apache-github-source-source/itests/hive-unit/src/main/resources
[INFO] Copying 3 resources
[INFO] 
[INFO] --- maven-antrun-plugin:1.7:run (define-classpath) @ hive-it-unit ---
[INFO] Executing tasks

main:
[INFO] Executed tasks
[INFO] 
[INFO] --- maven-compiler-plugin:3.1:compile (default-compile) @ hive-it-unit ---
[INFO] Compiling 2 source files to /data/hive-ptest/working/apache-github-source-source/itests/hive-unit/target/classes
[INFO] 
[INFO] --- maven-resources-plugin:2.6:testResources (default-testResources) @ hive-it-unit
---
[INFO] Using 'UTF-8' encoding to copy filtered resources.
[INFO] skip non existing resourceDirectory /data/hive-ptest/working/apache-github-source-source/itests/hive-unit/src/test/resources
[INFO] Copying 3 resources
[INFO] 
[INFO] --- maven-antrun-plugin:1.7:run (setup-test-dirs) @ hive-it-unit ---
[INFO] Executing tasks

main:
    [mkdir] Created dir: /data/hive-ptest/working/apache-github-source-source/itests/hive-unit/target/tmp
    [mkdir] Created dir: /data/hive-ptest/working/apache-github-source-source/itests/hive-unit/target/warehouse
    [mkdir] Created dir: /data/hive-ptest/working/apache-github-source-source/itests/hive-unit/target/tmp/conf
     [copy] Copying 15 files to /data/hive-ptest/working/apache-github-source-source/itests/hive-unit/target/tmp/conf
[INFO] Executed tasks
[INFO] 
[INFO] --- maven-antrun-plugin:1.7:run (setup-metastore-scripts) @ hive-it-unit ---
[INFO] Executing tasks

main:
    [mkdir] Created dir: /data/hive-ptest/working/apache-github-source-source/itests/hive-unit/target/tmp/scripts/metastore
     [copy] Copying 318 files to /data/hive-ptest/working/apache-github-source-source/itests/hive-unit/target/tmp/scripts/metastore
[INFO] Executed tasks
[INFO] 
[INFO] --- maven-compiler-plugin:3.1:testCompile (default-testCompile) @ hive-it-unit ---
[INFO] Compiling 106 source files to /data/hive-ptest/working/apache-github-source-source/itests/hive-unit/target/test-classes
[INFO] -------------------------------------------------------------
[WARNING] COMPILATION WARNING : 
[INFO] -------------------------------------------------------------
[WARNING] /data/hive-ptest/working/apache-github-source-source/itests/hive-unit/src/test/java/org/apache/hadoop/hive/metastore/TestRetryingHMSHandler.java:
Some input files use or override a deprecated API.
[WARNING] /data/hive-ptest/working/apache-github-source-source/itests/hive-unit/src/test/java/org/apache/hadoop/hive/metastore/TestRetryingHMSHandler.java:
Recompile with -Xlint:deprecation for details.
[WARNING] /data/hive-ptest/working/apache-github-source-source/itests/hive-unit/src/test/java/org/apache/hadoop/hive/metastore/TestHiveMetaStore.java:
Some input files use unchecked or unsafe operations.
[WARNING] /data/hive-ptest/working/apache-github-source-source/itests/hive-unit/src/test/java/org/apache/hadoop/hive/metastore/TestHiveMetaStore.java:
Recompile with -Xlint:unchecked for details.
[INFO] 4 warnings 
[INFO] -------------------------------------------------------------
[INFO] -------------------------------------------------------------
[ERROR] COMPILATION ERROR : 
[INFO] -------------------------------------------------------------
[ERROR] /data/hive-ptest/working/apache-github-source-source/itests/hive-unit/src/test/java/org/apache/hadoop/hive/llap/ext/TestLlapInputSplit.java:[62,29]
no suitable constructor found for LlapInputSplit(int,byte[],byte[],org.apache.hadoop.mapred.SplitLocationInfo[],org.apache.hadoop.hive.llap.Schema,java.lang.String)
    constructor org.apache.hadoop.hive.llap.LlapInputSplit.LlapInputSplit(int,byte[],byte[],byte[],org.apache.hadoop.mapred.SplitLocationInfo[],org.apache.hadoop.hive.llap.Schema,java.lang.String)
is not applicable
      (actual and formal argument lists differ in length)
    constructor org.apache.hadoop.hive.llap.LlapInputSplit.LlapInputSplit() is not applicable
      (actual and formal argument lists differ in length)
[INFO] 1 error
[INFO] -------------------------------------------------------------
[INFO] ------------------------------------------------------------------------
[INFO] Reactor Summary:
[INFO] 
[INFO] Hive Integration - Parent ......................... SUCCESS [2.517s]
[INFO] Hive Integration - Custom Serde ................... SUCCESS [5.109s]
[INFO] Hive Integration - Custom udfs .................... SUCCESS [1.117s]
[INFO] Hive Integration - Custom UDFs - udf-classloader-util  SUCCESS [1.566s]
[INFO] Hive Integration - Custom UDFs - udf-classloader-udf1  SUCCESS [0.947s]
[INFO] Hive Integration - Custom UDFs - udf-classloader-udf2  SUCCESS [1.176s]
[INFO] Hive Integration - HCatalog Unit Tests ............ SUCCESS [5.076s]
[INFO] Hive Integration - Testing Utilities .............. SUCCESS [5.334s]
[INFO] Hive Integration - Unit Tests ..................... FAILURE [10.447s]
[INFO] Hive Integration - Test Serde ..................... SKIPPED
[INFO] Hive Integration - QFile Tests .................... SKIPPED
[INFO] Hive Integration - QFile Accumulo Tests ........... SKIPPED
[INFO] JMH benchmark: Hive ............................... SKIPPED
[INFO] Hive Integration - Unit Tests - Hadoop 2 .......... SKIPPED
[INFO] Hive Integration - Unit Tests with miniKdc ........ SKIPPED
[INFO] Hive Integration - QFile Spark Tests .............. SKIPPED
[INFO] ------------------------------------------------------------------------
[INFO] BUILD FAILURE
[INFO] ------------------------------------------------------------------------
[INFO] Total time: 34.636s
[INFO] Finished at: Fri May 20 00:55:49 GMT 2016
[INFO] Final Memory: 103M/809M
[INFO] ------------------------------------------------------------------------
[WARNING] The requested profile "hadoop-1" could not be activated because it does not exist.
[ERROR] Failed to execute goal org.apache.maven.plugins:maven-compiler-plugin:3.1:testCompile
(default-testCompile) on project hive-it-unit: Compilation failure
[ERROR] /data/hive-ptest/working/apache-github-source-source/itests/hive-unit/src/test/java/org/apache/hadoop/hive/llap/ext/TestLlapInputSplit.java:[62,29]
no suitable constructor found for LlapInputSplit(int,byte[],byte[],org.apache.hadoop.mapred.SplitLocationInfo[],org.apache.hadoop.hive.llap.Schema,java.lang.String)
[ERROR] constructor org.apache.hadoop.hive.llap.LlapInputSplit.LlapInputSplit(int,byte[],byte[],byte[],org.apache.hadoop.mapred.SplitLocationInfo[],org.apache.hadoop.hive.llap.Schema,java.lang.String)
is not applicable
[ERROR] (actual and formal argument lists differ in length)
[ERROR] constructor org.apache.hadoop.hive.llap.LlapInputSplit.LlapInputSplit() is not applicable
[ERROR] (actual and formal argument lists differ in length)
[ERROR] -> [Help 1]
[ERROR] 
[ERROR] To see the full stack trace of the errors, re-run Maven with the -e switch.
[ERROR] Re-run Maven using the -X switch to enable full debug logging.
[ERROR] 
[ERROR] For more information about the errors and possible solutions, please read the following
articles:
[ERROR] [Help 1] http://cwiki.apache.org/confluence/display/MAVEN/MojoFailureException
[ERROR] 
[ERROR] After correcting the problems, you can resume the build with the command
[ERROR]   mvn <goals> -rf :hive-it-unit
+ exit 1
'
{noformat}

This message is automatically generated.

ATTACHMENT ID: 12804821 - PreCommit-HIVE-MASTER-Build

> LLAP: signing for the second state of submit (the event)
> --------------------------------------------------------
>
>                 Key: HIVE-13443
>                 URL: https://issues.apache.org/jira/browse/HIVE-13443
>             Project: Hive
>          Issue Type: Sub-task
>            Reporter: Sergey Shelukhin
>            Assignee: Sergey Shelukhin
>         Attachments: HIVE-13443.WIP.nogen.patch, HIVE-13443.patch, HIVE-13443.wo.13444.13675.nogen.patch
>
>




--
This message was sent by Atlassian JIRA
(v6.3.4#6332)

Mime
View raw message