hive-issues mailing list archives

Site index · List index
Message view « Date » · « Thread »
Top « Date » · « Thread »
From "Hive QA (JIRA)" <j...@apache.org>
Subject [jira] [Commented] (HIVE-9660) store end offset of compressed data for RG in RowIndex in ORC
Date Wed, 06 Apr 2016 17:27:25 GMT

    [ https://issues.apache.org/jira/browse/HIVE-9660?page=com.atlassian.jira.plugin.system.issuetabpanels:comment-tabpanel&focusedCommentId=15228695#comment-15228695
] 

Hive QA commented on HIVE-9660:
-------------------------------



Here are the results of testing the latest attachment:
https://issues.apache.org/jira/secure/attachment/12797148/HIVE-9660.04.patch

{color:red}ERROR:{color} -1 due to build exiting with an error

Test results: http://ec2-174-129-184-35.compute-1.amazonaws.com/jenkins/job/PreCommit-HIVE-TRUNK-Build/7490/testReport
Console output: http://ec2-174-129-184-35.compute-1.amazonaws.com/jenkins/job/PreCommit-HIVE-TRUNK-Build/7490/console
Test logs: http://ec2-174-129-184-35.compute-1.amazonaws.com/logs/PreCommit-HIVE-TRUNK-Build-7490/

Messages:
{noformat}
**** This message was trimmed, see log for full details ****
[INFO] Using 'UTF-8' encoding to copy filtered resources.
[INFO] skip non existing resourceDirectory /data/hive-ptest/working/apache-github-source-source/shims/aggregator/src/main/resources
[INFO] Copying 3 resources
[INFO] 
[INFO] --- maven-antrun-plugin:1.7:run (define-classpath) @ hive-shims ---
[INFO] Executing tasks

main:
[INFO] Executed tasks
[INFO] 
[INFO] --- maven-compiler-plugin:3.1:compile (default-compile) @ hive-shims ---
[INFO] No sources to compile
[INFO] 
[INFO] --- maven-resources-plugin:2.6:testResources (default-testResources) @ hive-shims ---
[INFO] Using 'UTF-8' encoding to copy filtered resources.
[INFO] skip non existing resourceDirectory /data/hive-ptest/working/apache-github-source-source/shims/aggregator/src/test/resources
[INFO] Copying 3 resources
[INFO] 
[INFO] --- maven-antrun-plugin:1.7:run (setup-test-dirs) @ hive-shims ---
[INFO] Executing tasks

main:
    [mkdir] Created dir: /data/hive-ptest/working/apache-github-source-source/shims/aggregator/target/tmp
    [mkdir] Created dir: /data/hive-ptest/working/apache-github-source-source/shims/aggregator/target/warehouse
    [mkdir] Created dir: /data/hive-ptest/working/apache-github-source-source/shims/aggregator/target/tmp/conf
     [copy] Copying 15 files to /data/hive-ptest/working/apache-github-source-source/shims/aggregator/target/tmp/conf
[INFO] Executed tasks
[INFO] 
[INFO] --- maven-compiler-plugin:3.1:testCompile (default-testCompile) @ hive-shims ---
[INFO] No sources to compile
[INFO] 
[INFO] --- maven-surefire-plugin:2.16:test (default-test) @ hive-shims ---
[INFO] Tests are skipped.
[INFO] 
[INFO] --- maven-jar-plugin:2.2:jar (default-jar) @ hive-shims ---
[INFO] Building jar: /data/hive-ptest/working/apache-github-source-source/shims/aggregator/target/hive-shims-2.1.0-SNAPSHOT.jar
[INFO] 
[INFO] --- maven-site-plugin:3.3:attach-descriptor (attach-descriptor) @ hive-shims ---
[INFO] 
[INFO] --- maven-install-plugin:2.4:install (default-install) @ hive-shims ---
[INFO] Installing /data/hive-ptest/working/apache-github-source-source/shims/aggregator/target/hive-shims-2.1.0-SNAPSHOT.jar
to /data/hive-ptest/working/maven/org/apache/hive/hive-shims/2.1.0-SNAPSHOT/hive-shims-2.1.0-SNAPSHOT.jar
[INFO] Installing /data/hive-ptest/working/apache-github-source-source/shims/aggregator/pom.xml
to /data/hive-ptest/working/maven/org/apache/hive/hive-shims/2.1.0-SNAPSHOT/hive-shims-2.1.0-SNAPSHOT.pom
[INFO]                                                                         
[INFO] ------------------------------------------------------------------------
[INFO] Building Hive Storage API 2.1.0-SNAPSHOT
[INFO] ------------------------------------------------------------------------
[INFO] 
[INFO] --- maven-clean-plugin:2.5:clean (default-clean) @ hive-storage-api ---
[INFO] Deleting /data/hive-ptest/working/apache-github-source-source/storage-api/target
[INFO] Deleting /data/hive-ptest/working/apache-github-source-source/storage-api (includes
= [datanucleus.log, derby.log], excludes = [])
[INFO] 
[INFO] --- maven-enforcer-plugin:1.3.1:enforce (enforce-no-snapshots) @ hive-storage-api ---
[INFO] 
[INFO] --- maven-remote-resources-plugin:1.5:process (default) @ hive-storage-api ---
[INFO] 
[INFO] --- maven-resources-plugin:2.6:resources (default-resources) @ hive-storage-api ---
[INFO] Using 'UTF-8' encoding to copy filtered resources.
[INFO] skip non existing resourceDirectory /data/hive-ptest/working/apache-github-source-source/storage-api/src/main/resources
[INFO] Copying 3 resources
[INFO] 
[INFO] --- maven-antrun-plugin:1.7:run (define-classpath) @ hive-storage-api ---
[INFO] Executing tasks

main:
[INFO] Executed tasks
[INFO] 
[INFO] --- maven-compiler-plugin:3.1:compile (default-compile) @ hive-storage-api ---
[INFO] Compiling 35 source files to /data/hive-ptest/working/apache-github-source-source/storage-api/target/classes
[WARNING] /data/hive-ptest/working/apache-github-source-source/storage-api/src/java/org/apache/hadoop/hive/ql/exec/vector/IntervalDayTimeColumnVector.java:[29,51]
sun.util.calendar.BaseCalendar is internal proprietary API and may be removed in a future
release
[INFO] 
[INFO] --- maven-resources-plugin:2.6:testResources (default-testResources) @ hive-storage-api
---
[INFO] Using 'UTF-8' encoding to copy filtered resources.
[INFO] skip non existing resourceDirectory /data/hive-ptest/working/apache-github-source-source/storage-api/src/test/resources
[INFO] Copying 3 resources
[INFO] 
[INFO] --- maven-antrun-plugin:1.7:run (setup-test-dirs) @ hive-storage-api ---
[INFO] Executing tasks

main:
    [mkdir] Created dir: /data/hive-ptest/working/apache-github-source-source/storage-api/target/tmp
    [mkdir] Created dir: /data/hive-ptest/working/apache-github-source-source/storage-api/target/warehouse
    [mkdir] Created dir: /data/hive-ptest/working/apache-github-source-source/storage-api/target/tmp/conf
     [copy] Copying 15 files to /data/hive-ptest/working/apache-github-source-source/storage-api/target/tmp/conf
[INFO] Executed tasks
[INFO] 
[INFO] --- maven-compiler-plugin:3.1:testCompile (default-testCompile) @ hive-storage-api
---
[INFO] Compiling 6 source files to /data/hive-ptest/working/apache-github-source-source/storage-api/target/test-classes
[INFO] 
[INFO] --- maven-surefire-plugin:2.16:test (default-test) @ hive-storage-api ---
[INFO] Tests are skipped.
[INFO] 
[INFO] --- maven-jar-plugin:2.2:jar (default-jar) @ hive-storage-api ---
[INFO] Building jar: /data/hive-ptest/working/apache-github-source-source/storage-api/target/hive-storage-api-2.1.0-SNAPSHOT.jar
[INFO] 
[INFO] --- maven-site-plugin:3.3:attach-descriptor (attach-descriptor) @ hive-storage-api
---
[INFO] 
[INFO] --- maven-install-plugin:2.4:install (default-install) @ hive-storage-api ---
[INFO] Installing /data/hive-ptest/working/apache-github-source-source/storage-api/target/hive-storage-api-2.1.0-SNAPSHOT.jar
to /data/hive-ptest/working/maven/org/apache/hive/hive-storage-api/2.1.0-SNAPSHOT/hive-storage-api-2.1.0-SNAPSHOT.jar
[INFO] Installing /data/hive-ptest/working/apache-github-source-source/storage-api/pom.xml
to /data/hive-ptest/working/maven/org/apache/hive/hive-storage-api/2.1.0-SNAPSHOT/hive-storage-api-2.1.0-SNAPSHOT.pom
[INFO]                                                                         
[INFO] ------------------------------------------------------------------------
[INFO] Building Hive ORC 2.1.0-SNAPSHOT
[INFO] ------------------------------------------------------------------------
[INFO] 
[INFO] --- maven-clean-plugin:2.5:clean (default-clean) @ hive-orc ---
[INFO] Deleting /data/hive-ptest/working/apache-github-source-source/orc/target
[INFO] Deleting /data/hive-ptest/working/apache-github-source-source/orc (includes = [datanucleus.log,
derby.log], excludes = [])
[INFO] 
[INFO] --- maven-enforcer-plugin:1.3.1:enforce (enforce-no-snapshots) @ hive-orc ---
[INFO] 
[INFO] --- build-helper-maven-plugin:1.8:add-source (add-source) @ hive-orc ---
[INFO] Source directory: /data/hive-ptest/working/apache-github-source-source/orc/src/gen/protobuf-java
added.
[INFO] 
[INFO] --- maven-remote-resources-plugin:1.5:process (default) @ hive-orc ---
[INFO] 
[INFO] --- maven-resources-plugin:2.6:resources (default-resources) @ hive-orc ---
[INFO] Using 'UTF-8' encoding to copy filtered resources.
[INFO] skip non existing resourceDirectory /data/hive-ptest/working/apache-github-source-source/orc/src/main/resources
[INFO] Copying 3 resources
[INFO] 
[INFO] --- maven-antrun-plugin:1.7:run (define-classpath) @ hive-orc ---
[INFO] Executing tasks

main:
[INFO] Executed tasks
[INFO] 
[INFO] --- maven-compiler-plugin:3.1:compile (default-compile) @ hive-orc ---
[INFO] Compiling 60 source files to /data/hive-ptest/working/apache-github-source-source/orc/target/classes
[INFO] -------------------------------------------------------------
[ERROR] COMPILATION ERROR : 
[INFO] -------------------------------------------------------------
[ERROR] /data/hive-ptest/working/apache-github-source-source/orc/src/java/org/apache/orc/impl/WriterImpl.java:[1485,13]
cannot find symbol
  symbol:   method setLogSpill(boolean)
  location: variable stream of type org.apache.orc.impl.OutStream
[INFO] 1 error
[INFO] -------------------------------------------------------------
[INFO] ------------------------------------------------------------------------
[INFO] Reactor Summary:
[INFO] 
[INFO] Hive .............................................. SUCCESS [13.122s]
[INFO] Hive Shims Common ................................. SUCCESS [16.490s]
[INFO] Hive Shims 0.23 ................................... SUCCESS [13.199s]
[INFO] Hive Shims Scheduler .............................. SUCCESS [2.824s]
[INFO] Hive Shims ........................................ SUCCESS [2.451s]
[INFO] Hive Storage API .................................. SUCCESS [6.516s]
[INFO] Hive ORC .......................................... FAILURE [11.193s]
[INFO] Hive Common ....................................... SKIPPED
[INFO] Hive Serde ........................................ SKIPPED
[INFO] Hive Metastore .................................... SKIPPED
[INFO] Hive Ant Utilities ................................ SKIPPED
[INFO] Hive Llap Common .................................. SKIPPED
[INFO] Hive Llap Client .................................. SKIPPED
[INFO] Hive Llap Tez ..................................... SKIPPED
[INFO] Hive Service RPC .................................. SKIPPED
[INFO] Spark Remote Client ............................... SKIPPED
[INFO] Hive Query Language ............................... SKIPPED
[INFO] Hive Service ...................................... SKIPPED
[INFO] Hive Accumulo Handler ............................. SKIPPED
[INFO] Hive JDBC ......................................... SKIPPED
[INFO] Hive Beeline ...................................... SKIPPED
[INFO] Hive CLI .......................................... SKIPPED
[INFO] Hive Contrib ...................................... SKIPPED
[INFO] Hive HBase Handler ................................ SKIPPED
[INFO] Hive HCatalog ..................................... SKIPPED
[INFO] Hive HCatalog Core ................................ SKIPPED
[INFO] Hive HCatalog Pig Adapter ......................... SKIPPED
[INFO] Hive HCatalog Server Extensions ................... SKIPPED
[INFO] Hive HCatalog Webhcat Java Client ................. SKIPPED
[INFO] Hive HCatalog Webhcat ............................. SKIPPED
[INFO] Hive HCatalog Streaming ........................... SKIPPED
[INFO] Hive HPL/SQL ...................................... SKIPPED
[INFO] Hive HWI .......................................... SKIPPED
[INFO] Hive Llap Server .................................. SKIPPED
[INFO] Hive Shims Aggregator ............................. SKIPPED
[INFO] Hive TestUtils .................................... SKIPPED
[INFO] Hive Packaging .................................... SKIPPED
[INFO] ------------------------------------------------------------------------
[INFO] BUILD FAILURE
[INFO] ------------------------------------------------------------------------
[INFO] Total time: 1:09.016s
[INFO] Finished at: Wed Apr 06 13:26:29 EDT 2016
[INFO] Final Memory: 49M/162M
[INFO] ------------------------------------------------------------------------
[WARNING] The requested profile "hadoop-2" could not be activated because it does not exist.
[ERROR] Failed to execute goal org.apache.maven.plugins:maven-compiler-plugin:3.1:compile
(default-compile) on project hive-orc: Compilation failure
[ERROR] /data/hive-ptest/working/apache-github-source-source/orc/src/java/org/apache/orc/impl/WriterImpl.java:[1485,13]
cannot find symbol
[ERROR] symbol:   method setLogSpill(boolean)
[ERROR] location: variable stream of type org.apache.orc.impl.OutStream
[ERROR] -> [Help 1]
[ERROR] 
[ERROR] To see the full stack trace of the errors, re-run Maven with the -e switch.
[ERROR] Re-run Maven using the -X switch to enable full debug logging.
[ERROR] 
[ERROR] For more information about the errors and possible solutions, please read the following
articles:
[ERROR] [Help 1] http://cwiki.apache.org/confluence/display/MAVEN/MojoFailureException
[ERROR] 
[ERROR] After correcting the problems, you can resume the build with the command
[ERROR]   mvn <goals> -rf :hive-orc
+ exit 1
'
{noformat}

This message is automatically generated.

ATTACHMENT ID: 12797148 - PreCommit-HIVE-TRUNK-Build

> store end offset of compressed data for RG in RowIndex in ORC
> -------------------------------------------------------------
>
>                 Key: HIVE-9660
>                 URL: https://issues.apache.org/jira/browse/HIVE-9660
>             Project: Hive
>          Issue Type: Bug
>            Reporter: Sergey Shelukhin
>            Assignee: Sergey Shelukhin
>         Attachments: HIVE-9660.01.patch, HIVE-9660.02.patch, HIVE-9660.03.patch, HIVE-9660.04.patch,
HIVE-9660.patch, HIVE-9660.patch
>
>
> Right now the end offset is estimated, which in some cases results in tons of extra data
being read.
> We can add a separate array to RowIndex (positions_v2?) that stores number of compressed
buffers for each RG, or end offset, or something, to remove this estimation magic



--
This message was sent by Atlassian JIRA
(v6.3.4#6332)

Mime
View raw message