hive-issues mailing list archives

Site index · List index
Message view « Date » · « Thread »
Top « Date » · « Thread »
From "Hive QA (JIRA)" <j...@apache.org>
Subject [jira] [Commented] (HIVE-13119) java.io.IOException: java.io.IOException: ORC does not support type conversion from CHAR to VARCHAR (due to Schema Evolution HIVE-11981)
Date Tue, 23 Feb 2016 16:17:18 GMT

    [ https://issues.apache.org/jira/browse/HIVE-13119?page=com.atlassian.jira.plugin.system.issuetabpanels:comment-tabpanel&focusedCommentId=15159114#comment-15159114
] 

Hive QA commented on HIVE-13119:
--------------------------------



Here are the results of testing the latest attachment:
https://issues.apache.org/jira/secure/attachment/12789160/HIVE-13119.01.patch

{color:red}ERROR:{color} -1 due to no test(s) being added or modified.

{color:red}ERROR:{color} -1 due to 24 failed/errored test(s), 9789 tests executed
*Failed tests:*
{noformat}
TestMiniTezCliDriver-dynpart_sort_optimization2.q-cte_mat_1.q-tez_bmj_schema_evolution.q-and-12-more
- did not produce a TEST-*.xml file
TestSparkCliDriver-timestamp_lazy.q-bucketsortoptimize_insert_4.q-date_udf.q-and-12-more -
did not produce a TEST-*.xml file
org.apache.hadoop.hive.cli.TestCliDriver.testCliDriver_orc_int_type_promotion
org.apache.hadoop.hive.cli.TestCliDriver.testCliDriver_orc_schema_evolution
org.apache.hadoop.hive.cli.TestCliDriver.testCliDriver_schema_evol_orc_nonvec_mapwork_table
org.apache.hadoop.hive.cli.TestMiniTezCliDriver.org.apache.hadoop.hive.cli.TestMiniTezCliDriver
org.apache.hadoop.hive.cli.TestMiniTezCliDriver.testCliDriver_cbo_join
org.apache.hadoop.hive.cli.TestMiniTezCliDriver.testCliDriver_constprog_semijoin
org.apache.hadoop.hive.cli.TestMiniTezCliDriver.testCliDriver_insert_orig_table
org.apache.hadoop.hive.cli.TestMiniTezCliDriver.testCliDriver_merge1
org.apache.hadoop.hive.cli.TestMiniTezCliDriver.testCliDriver_orc_merge7
org.apache.hadoop.hive.cli.TestMiniTezCliDriver.testCliDriver_sample1
org.apache.hadoop.hive.cli.TestMiniTezCliDriver.testCliDriver_schema_evol_orc_acid_mapwork_part
org.apache.hadoop.hive.cli.TestMiniTezCliDriver.testCliDriver_schema_evol_orc_nonvec_mapwork_table
org.apache.hadoop.hive.cli.TestMiniTezCliDriver.testCliDriver_schema_evol_text_fetchwork_table
org.apache.hadoop.hive.cli.TestMiniTezCliDriver.testCliDriver_stats_only_null
org.apache.hadoop.hive.cli.TestMiniTezCliDriver.testCliDriver_vector_char_2
org.apache.hadoop.hive.cli.TestMiniTezCliDriver.testCliDriver_vector_count_distinct
org.apache.hadoop.hive.cli.TestMiniTezCliDriver.testCliDriver_vector_decimal_2
org.apache.hadoop.hive.cli.TestMiniTezCliDriver.testCliDriver_vector_decimal_udf2
org.apache.hadoop.hive.cli.TestMiniTezCliDriver.testCliDriver_vector_mr_diff_schema_alias
org.apache.hadoop.hive.cli.TestMiniTezCliDriver.testCliDriver_vector_null_projection
org.apache.hadoop.hive.cli.TestNegativeCliDriver.testNegativeCliDriver_authorization_uri_import
org.apache.hive.jdbc.TestSSL.testSSLVersion
{noformat}

Test results: http://ec2-174-129-184-35.compute-1.amazonaws.com/jenkins/job/PreCommit-HIVE-TRUNK-Build/7068/testReport
Console output: http://ec2-174-129-184-35.compute-1.amazonaws.com/jenkins/job/PreCommit-HIVE-TRUNK-Build/7068/console
Test logs: http://ec2-174-129-184-35.compute-1.amazonaws.com/logs/PreCommit-HIVE-TRUNK-Build-7068/

Messages:
{noformat}
Executing org.apache.hive.ptest.execution.TestCheckPhase
Executing org.apache.hive.ptest.execution.PrepPhase
Executing org.apache.hive.ptest.execution.ExecutionPhase
Executing org.apache.hive.ptest.execution.ReportingPhase
Tests exited with: TestsFailedException: 24 tests failed
{noformat}

This message is automatically generated.

ATTACHMENT ID: 12789160 - PreCommit-HIVE-TRUNK-Build

> java.io.IOException: java.io.IOException: ORC does not support type conversion from CHAR
to VARCHAR (due to Schema Evolution HIVE-11981)
> ----------------------------------------------------------------------------------------------------------------------------------------
>
>                 Key: HIVE-13119
>                 URL: https://issues.apache.org/jira/browse/HIVE-13119
>             Project: Hive
>          Issue Type: Bug
>          Components: Hive, ORC
>    Affects Versions: 2.1.0
>            Reporter: Matt McCline
>            Assignee: Matt McCline
>            Priority: Critical
>         Attachments: HIVE-13119.01.patch
>
>
> From e-mail to user@hive.apache.org
> {noformat}
> New version Hive 2
> a simple Job fails with
>  
>  
> 2016-02-22T18:23:29,008 ERROR [main]: mr.MapredLocalTask (MapredLocalTask.java:executeInProcess(381))
- Hive Runtime Error: Map local work failed
> java.io.IOException: java.io.IOException: ORC does not support type conversion from CHAR
to VARCHAR
>  
> This was working OK in Hive 1.2.1! I am using MR here
> -- 
> Dr Mich Talebzadeh
> {noformat}



--
This message was sent by Atlassian JIRA
(v6.3.4#6332)

Mime
View raw message