hive-issues mailing list archives

Site index · List index
Message view « Date » · « Thread »
Top « Date » · « Thread »
From "Hive QA (JIRA)" <j...@apache.org>
Subject [jira] [Commented] (HIVE-13041) Backport to branch-1 HIVE-9862 Vectorized execution corrupts timestamp values
Date Thu, 11 Feb 2016 07:08:18 GMT

    [ https://issues.apache.org/jira/browse/HIVE-13041?page=com.atlassian.jira.plugin.system.issuetabpanels:comment-tabpanel&focusedCommentId=15142331#comment-15142331
] 

Hive QA commented on HIVE-13041:
--------------------------------



Here are the results of testing the latest attachment:
https://issues.apache.org/jira/secure/attachment/12787420/HIVE-13041.1-branch1.patch

{color:red}ERROR:{color} -1 due to build exiting with an error

Test results: http://ec2-174-129-184-35.compute-1.amazonaws.com/jenkins/job/PreCommit-HIVE-BRANCH_1-Build/23/testReport
Console output: http://ec2-174-129-184-35.compute-1.amazonaws.com/jenkins/job/PreCommit-HIVE-BRANCH_1-Build/23/console
Test logs: http://ec2-174-129-184-35.compute-1.amazonaws.com/logs/PreCommit-HIVE-BRANCH_1-Build-23/

Messages:
{noformat}
**** This message was trimmed, see log for full details ****
Generating class name FuncRoundDecimalToDecimal
Generating class name FuncBRoundDecimalToDecimal
Generating class name FuncNegateDecimalToDecimal
Generating class name CastDoubleToLong
Generating class name CastLongToDouble
Generating class name CastDoubleToBooleanViaDoubleToLong
Generating class name CastLongToBooleanViaLongToLong
Generating class name CastDateToBooleanViaLongToLong
Generating class name LongColUnaryMinus
Generating class name DoubleColUnaryMinus
Generating class name IfExprLongColumnLongColumn
Generating class name IfExprDoubleColumnDoubleColumn
Generating class name IfExprLongColumnLongScalar
Generating class name IfExprDoubleColumnLongScalar
Generating class name IfExprLongColumnDoubleScalar
Generating class name IfExprDoubleColumnDoubleScalar
Generating class name IfExprLongScalarLongColumn
Generating class name IfExprDoubleScalarLongColumn
Generating class name IfExprLongScalarDoubleColumn
Generating class name IfExprDoubleScalarDoubleColumn
Generating class name IfExprLongScalarLongScalar
Generating class name IfExprDoubleScalarLongScalar
Generating class name IfExprLongScalarDoubleScalar
Generating class name IfExprDoubleScalarDoubleScalar
Generating class name VectorUDAFMinLong
Generating class name VectorUDAFMinDouble
Generating class name VectorUDAFMaxLong
Generating class name VectorUDAFMaxDouble
Generating class name VectorUDAFMaxDecimal
Generating class name VectorUDAFMinDecimal
Generating class name VectorUDAFMinString
Generating class name VectorUDAFMaxString
Generating class name VectorUDAFMaxTimestamp
Generating class name VectorUDAFMinTimestamp
Generating class name VectorUDAFSumLong
Generating class name VectorUDAFSumDouble
Generating class name VectorUDAFAvgLong
Generating class name VectorUDAFAvgDouble
Generating class name VectorUDAFVarPopLong
Generating class name VectorUDAFVarPopDouble
Generating class name VectorUDAFVarPopDecimal
Generating class name VectorUDAFVarSampLong
Generating class name VectorUDAFVarSampDouble
Generating class name VectorUDAFVarSampDecimal
Generating class name VectorUDAFStdPopLong
Generating class name VectorUDAFStdPopDouble
Generating class name VectorUDAFStdPopDecimal
Generating class name VectorUDAFStdSampLong
Generating class name VectorUDAFStdSampDouble
Generating class name VectorUDAFStdSampDecimal
Generating vector expression test code
[INFO] Executed tasks
[INFO] 
[INFO] --- build-helper-maven-plugin:1.8:add-source (add-source) @ hive-exec ---
[INFO] Source directory: /data/hive-ptest/working/apache-github-branch1-source/ql/src/gen/protobuf/gen-java
added.
[INFO] Source directory: /data/hive-ptest/working/apache-github-branch1-source/ql/src/gen/thrift/gen-javabean
added.
[INFO] Source directory: /data/hive-ptest/working/apache-github-branch1-source/ql/target/generated-sources/java
added.
[INFO] 
[INFO] --- antlr3-maven-plugin:3.4:antlr (default) @ hive-exec ---
[INFO] ANTLR: Processing source directory /data/hive-ptest/working/apache-github-branch1-source/ql/src/java
ANTLR Parser Generator  Version 3.4
org/apache/hadoop/hive/ql/parse/HiveLexer.g
org/apache/hadoop/hive/ql/parse/HiveParser.g
warning(200): IdentifiersParser.g:455:5: 
Decision can match input such as "{KW_REGEXP, KW_RLIKE} KW_UNION KW_FROM" using multiple alternatives:
2, 9

As a result, alternative(s) 9 were disabled for that input
warning(200): IdentifiersParser.g:455:5: 
Decision can match input such as "{KW_REGEXP, KW_RLIKE} KW_DISTRIBUTE KW_BY" using multiple
alternatives: 2, 9

As a result, alternative(s) 9 were disabled for that input
warning(200): IdentifiersParser.g:455:5: 
Decision can match input such as "{KW_REGEXP, KW_RLIKE} KW_INSERT KW_INTO" using multiple
alternatives: 2, 9

As a result, alternative(s) 9 were disabled for that input
warning(200): IdentifiersParser.g:455:5: 
Decision can match input such as "{KW_REGEXP, KW_RLIKE} KW_LATERAL KW_VIEW" using multiple
alternatives: 2, 9

As a result, alternative(s) 9 were disabled for that input
warning(200): IdentifiersParser.g:455:5: 
Decision can match input such as "{KW_REGEXP, KW_RLIKE} KW_SORT KW_BY" using multiple alternatives:
2, 9

As a result, alternative(s) 9 were disabled for that input
warning(200): IdentifiersParser.g:455:5: 
Decision can match input such as "{KW_REGEXP, KW_RLIKE} KW_INSERT KW_OVERWRITE" using multiple
alternatives: 2, 9

As a result, alternative(s) 9 were disabled for that input
warning(200): IdentifiersParser.g:455:5: 
Decision can match input such as "{KW_REGEXP, KW_RLIKE} KW_MAP LPAREN" using multiple alternatives:
2, 9

As a result, alternative(s) 9 were disabled for that input
warning(200): IdentifiersParser.g:455:5: 
Decision can match input such as "{KW_REGEXP, KW_RLIKE} KW_ORDER KW_BY" using multiple alternatives:
2, 9

As a result, alternative(s) 9 were disabled for that input
warning(200): IdentifiersParser.g:455:5: 
Decision can match input such as "{KW_REGEXP, KW_RLIKE} KW_UNION KW_ALL" using multiple alternatives:
2, 9

As a result, alternative(s) 9 were disabled for that input
warning(200): IdentifiersParser.g:455:5: 
Decision can match input such as "{KW_REGEXP, KW_RLIKE} KW_GROUP KW_BY" using multiple alternatives:
2, 9

As a result, alternative(s) 9 were disabled for that input
warning(200): IdentifiersParser.g:455:5: 
Decision can match input such as "{KW_REGEXP, KW_RLIKE} KW_UNION KW_SELECT" using multiple
alternatives: 2, 9

As a result, alternative(s) 9 were disabled for that input
warning(200): IdentifiersParser.g:455:5: 
Decision can match input such as "{KW_REGEXP, KW_RLIKE} KW_UNION KW_MAP" using multiple alternatives:
2, 9

As a result, alternative(s) 9 were disabled for that input
warning(200): IdentifiersParser.g:455:5: 
Decision can match input such as "{KW_REGEXP, KW_RLIKE} KW_UNION KW_REDUCE" using multiple
alternatives: 2, 9

As a result, alternative(s) 9 were disabled for that input
warning(200): IdentifiersParser.g:455:5: 
Decision can match input such as "{KW_REGEXP, KW_RLIKE} KW_CLUSTER KW_BY" using multiple alternatives:
2, 9

As a result, alternative(s) 9 were disabled for that input
[INFO] 
[INFO] --- maven-remote-resources-plugin:1.5:process (default) @ hive-exec ---
Downloading: http://www.datanucleus.org/downloads/maven2/org/pentaho/pentaho-aggdesigner-algorithm/5.1.5-jhyde/pentaho-aggdesigner-algorithm-5.1.5-jhyde.pom

Downloading: http://repo.maven.apache.org/maven2/org/pentaho/pentaho-aggdesigner-algorithm/5.1.5-jhyde/pentaho-aggdesigner-algorithm-5.1.5-jhyde.pom

[INFO] 
[INFO] --- maven-resources-plugin:2.6:resources (default-resources) @ hive-exec ---
[INFO] Using 'UTF-8' encoding to copy filtered resources.
[INFO] Copying 2 resources
[INFO] Copying 3 resources
[INFO] 
[INFO] --- maven-antrun-plugin:1.7:run (define-classpath) @ hive-exec ---
[INFO] Executing tasks

main:
[INFO] Executed tasks
[INFO] 
[INFO] --- maven-compiler-plugin:2.3.2:compile (default-compile) @ hive-exec ---
[INFO] Compiling 2645 source files to /data/hive-ptest/working/apache-github-branch1-source/ql/target/classes
[INFO] -------------------------------------------------------------
[ERROR] COMPILATION ERROR : 
[INFO] -------------------------------------------------------------
[ERROR] /data/hive-ptest/working/apache-github-branch1-source/ql/src/java/org/apache/hadoop/hive/ql/io/orc/FileDump.java:[535,29]
error: cannot find symbol
[INFO] 1 error
[INFO] -------------------------------------------------------------
[INFO] ------------------------------------------------------------------------
[INFO] Reactor Summary:
[INFO] 
[INFO] Hive .............................................. SUCCESS [14.402s]
[INFO] Hive Shims Common ................................. SUCCESS [21.043s]
[INFO] Hive Shims 0.20S .................................. SUCCESS [7.268s]
[INFO] Hive Shims 0.23 ................................... SUCCESS [18.005s]
[INFO] Hive Shims Scheduler .............................. SUCCESS [5.526s]
[INFO] Hive Shims ........................................ SUCCESS [6.851s]
[INFO] Hive Common ....................................... SUCCESS [29.749s]
[INFO] Hive Serde ........................................ SUCCESS [33.730s]
[INFO] Hive Metastore .................................... SUCCESS [49.379s]
[INFO] Hive Ant Utilities ................................ SUCCESS [2.073s]
[INFO] Spark Remote Client ............................... SUCCESS [21.567s]
[INFO] Hive Query Language ............................... FAILURE [1:40.525s]
[INFO] Hive Service ...................................... SKIPPED
[INFO] Hive Accumulo Handler ............................. SKIPPED
[INFO] Hive JDBC ......................................... SKIPPED
[INFO] Hive Beeline ...................................... SKIPPED
[INFO] Hive CLI .......................................... SKIPPED
[INFO] Hive Contrib ...................................... SKIPPED
[INFO] Hive HBase Handler ................................ SKIPPED
[INFO] Hive HCatalog ..................................... SKIPPED
[INFO] Hive HCatalog Core ................................ SKIPPED
[INFO] Hive HCatalog Pig Adapter ......................... SKIPPED
[INFO] Hive HCatalog Server Extensions ................... SKIPPED
[INFO] Hive HCatalog Webhcat Java Client ................. SKIPPED
[INFO] Hive HCatalog Webhcat ............................. SKIPPED
[INFO] Hive HCatalog Streaming ........................... SKIPPED
[INFO] Hive HWI .......................................... SKIPPED
[INFO] Hive ODBC ......................................... SKIPPED
[INFO] Hive Shims Aggregator ............................. SKIPPED
[INFO] Hive TestUtils .................................... SKIPPED
[INFO] Hive Packaging .................................... SKIPPED
[INFO] ------------------------------------------------------------------------
[INFO] BUILD FAILURE
[INFO] ------------------------------------------------------------------------
[INFO] Total time: 5:13.161s
[INFO] Finished at: Thu Feb 11 02:08:05 EST 2016
[INFO] Final Memory: 133M/677M
[INFO] ------------------------------------------------------------------------
[ERROR] Failed to execute goal org.apache.maven.plugins:maven-compiler-plugin:2.3.2:compile
(default-compile) on project hive-exec: Compilation failure
[ERROR] /data/hive-ptest/working/apache-github-branch1-source/ql/src/java/org/apache/hadoop/hive/ql/io/orc/FileDump.java:[535,29]
error: cannot find symbol
[ERROR] -> [Help 1]
[ERROR] 
[ERROR] To see the full stack trace of the errors, re-run Maven with the -e switch.
[ERROR] Re-run Maven using the -X switch to enable full debug logging.
[ERROR] 
[ERROR] For more information about the errors and possible solutions, please read the following
articles:
[ERROR] [Help 1] http://cwiki.apache.org/confluence/display/MAVEN/MojoFailureException
[ERROR] 
[ERROR] After correcting the problems, you can resume the build with the command
[ERROR]   mvn <goals> -rf :hive-exec
+ exit 1
'
{noformat}

This message is automatically generated.

ATTACHMENT ID: 12787420 - PreCommit-HIVE-BRANCH_1-Build

> Backport to branch-1 HIVE-9862 Vectorized execution corrupts timestamp values
> -----------------------------------------------------------------------------
>
>                 Key: HIVE-13041
>                 URL: https://issues.apache.org/jira/browse/HIVE-13041
>             Project: Hive
>          Issue Type: Bug
>          Components: Hive
>            Reporter: Matt McCline
>            Assignee: Matt McCline
>            Priority: Critical
>         Attachments: HIVE-13041.1-branch1.patch
>
>
> Backport.



--
This message was sent by Atlassian JIRA
(v6.3.4#6332)

Mime
View raw message