hive-issues mailing list archives

Site index · List index
Message view « Date » · « Thread »
Top « Date » · « Thread »
From "Hive QA (JIRA)" <j...@apache.org>
Subject [jira] [Commented] (HIVE-12891) Hive fails when java.io.tmpdir is set to a relative location
Date Mon, 25 Jan 2016 22:44:39 GMT

    [ https://issues.apache.org/jira/browse/HIVE-12891?page=com.atlassian.jira.plugin.system.issuetabpanels:comment-tabpanel&focusedCommentId=15116222#comment-15116222
] 

Hive QA commented on HIVE-12891:
--------------------------------



Here are the results of testing the latest attachment:
https://issues.apache.org/jira/secure/attachment/12784190/HIVE-12891.04.patch

{color:green}SUCCESS:{color} +1 due to 1 test(s) being added or modified.

{color:red}ERROR:{color} -1 due to 3 failed/errored test(s), 10030 tests executed
*Failed tests:*
{noformat}
TestHWISessionManager - did not produce a TEST-*.xml file
org.apache.hadoop.hive.cli.TestNegativeCliDriver.testNegativeCliDriver_authorization_uri_import
org.apache.hive.jdbc.TestSSL.testSSLVersion
{noformat}

Test results: http://ec2-174-129-184-35.compute-1.amazonaws.com/jenkins/job/PreCommit-HIVE-TRUNK-Build/6735/testReport
Console output: http://ec2-174-129-184-35.compute-1.amazonaws.com/jenkins/job/PreCommit-HIVE-TRUNK-Build/6735/console
Test logs: http://ec2-174-129-184-35.compute-1.amazonaws.com/logs/PreCommit-HIVE-TRUNK-Build-6735/

Messages:
{noformat}
Executing org.apache.hive.ptest.execution.TestCheckPhase
Executing org.apache.hive.ptest.execution.PrepPhase
Executing org.apache.hive.ptest.execution.ExecutionPhase
Executing org.apache.hive.ptest.execution.ReportingPhase
Tests exited with: TestsFailedException: 3 tests failed
{noformat}

This message is automatically generated.

ATTACHMENT ID: 12784190 - PreCommit-HIVE-TRUNK-Build

> Hive fails when java.io.tmpdir is set to a relative location
> ------------------------------------------------------------
>
>                 Key: HIVE-12891
>                 URL: https://issues.apache.org/jira/browse/HIVE-12891
>             Project: Hive
>          Issue Type: Bug
>            Reporter: Reuben Kuhnert
>            Assignee: Reuben Kuhnert
>         Attachments: HIVE-12891.01.19.2016.01.patch, HIVE-12891.03.patch, HIVE-12891.04.patch,
HIVE-12981.01.22.2016.02.patch
>
>
> The function {{SessionState.createSessionDirs}} fails when trying to create directories
where {{java.io.tmpdir}} is set to a relative location.
> {code}
> \[uber-SubtaskRunner] ERROR o.a.h.hive..ql.Driver - FAILED: IllegalArgumentException
java.net.URISyntaxException: Relative path in absolute URI: file:./tmp/<user>/<guid>/hive_2015_12_11_09-12-25_352_4325234652356-1
> ...
> Minor variations:
> \[uber-SubtaskRunner] ERROR o.a.h.hive..ql.Driver - FAILED: SemanticException Exception
while processing Exception while writing out the local file 
> o.a.h.hive.ql/parse.SemanticException: Exception while processing exception while writing
out local file 
> ... 
> caused by: java.lang.IllegalArgumentException: java.net.URISyntaxException: Relative
path in absolute URI: file:./tmp/<user>/<guid>/hive_2015_12_11_09-12-25_352_4325234652356-1

> at o.a.h.fs.Path.initialize (206) 
> at o.a.h.fs.Path.<init>(197)... 
> at o.a.h.hive.ql.context.getScratchDir(267) 
> {code}



--
This message was sent by Atlassian JIRA
(v6.3.4#6332)

Mime
View raw message