hive-issues mailing list archives

Site index · List index
Message view « Date » · « Thread »
Top « Date » · « Thread »
From "Hive QA (JIRA)" <j...@apache.org>
Subject [jira] [Commented] (HIVE-12633) LLAP: package included serde jars
Date Thu, 10 Dec 2015 13:52:10 GMT

    [ https://issues.apache.org/jira/browse/HIVE-12633?page=com.atlassian.jira.plugin.system.issuetabpanels:comment-tabpanel&focusedCommentId=15050981#comment-15050981
] 

Hive QA commented on HIVE-12633:
--------------------------------



Here are the results of testing the latest attachment:
https://issues.apache.org/jira/secure/attachment/12776629/HIVE-12633.patch

{color:red}ERROR:{color} -1 due to build exiting with an error

Test results: http://ec2-174-129-184-35.compute-1.amazonaws.com/jenkins/job/PreCommit-HIVE-TRUNK-Build/6303/testReport
Console output: http://ec2-174-129-184-35.compute-1.amazonaws.com/jenkins/job/PreCommit-HIVE-TRUNK-Build/6303/console
Test logs: http://ec2-174-129-184-35.compute-1.amazonaws.com/logs/PreCommit-HIVE-TRUNK-Build-6303/

Messages:
{noformat}
**** This message was trimmed, see log for full details ****
[INFO] --- maven-install-plugin:2.4:install (default-install) @ hive-hplsql ---
[INFO] Installing /data/hive-ptest/working/apache-github-source-source/hplsql/target/hive-hplsql-2.1.0-SNAPSHOT.jar
to /data/hive-ptest/working/maven/org/apache/hive/hive-hplsql/2.1.0-SNAPSHOT/hive-hplsql-2.1.0-SNAPSHOT.jar
[INFO] Installing /data/hive-ptest/working/apache-github-source-source/hplsql/pom.xml to /data/hive-ptest/working/maven/org/apache/hive/hive-hplsql/2.1.0-SNAPSHOT/hive-hplsql-2.1.0-SNAPSHOT.pom
[INFO]                                                                         
[INFO] ------------------------------------------------------------------------
[INFO] Building Hive HWI 2.1.0-SNAPSHOT
[INFO] ------------------------------------------------------------------------
[INFO] 
[INFO] --- maven-clean-plugin:2.5:clean (default-clean) @ hive-hwi ---
[INFO] Deleting /data/hive-ptest/working/apache-github-source-source/hwi/target
[INFO] Deleting /data/hive-ptest/working/apache-github-source-source/hwi (includes = [datanucleus.log,
derby.log], excludes = [])
[INFO] 
[INFO] --- maven-enforcer-plugin:1.3.1:enforce (enforce-no-snapshots) @ hive-hwi ---
[INFO] 
[INFO] --- maven-remote-resources-plugin:1.5:process (default) @ hive-hwi ---
[INFO] 
[INFO] --- maven-resources-plugin:2.6:resources (default-resources) @ hive-hwi ---
[INFO] Using 'UTF-8' encoding to copy filtered resources.
[INFO] skip non existing resourceDirectory /data/hive-ptest/working/apache-github-source-source/hwi/src/main/resources
[INFO] Copying 3 resources
[INFO] 
[INFO] --- maven-antrun-plugin:1.7:run (define-classpath) @ hive-hwi ---
[INFO] Executing tasks

main:
[INFO] Executed tasks
[INFO] 
[INFO] --- maven-compiler-plugin:3.1:compile (default-compile) @ hive-hwi ---
[INFO] Compiling 6 source files to /data/hive-ptest/working/apache-github-source-source/hwi/target/classes
[INFO] 
[INFO] --- maven-resources-plugin:2.6:testResources (default-testResources) @ hive-hwi ---
[INFO] Using 'UTF-8' encoding to copy filtered resources.
[INFO] skip non existing resourceDirectory /data/hive-ptest/working/apache-github-source-source/hwi/src/test/resources
[INFO] Copying 3 resources
[INFO] 
[INFO] --- maven-antrun-plugin:1.7:run (setup-test-dirs) @ hive-hwi ---
[INFO] Executing tasks

main:
    [mkdir] Created dir: /data/hive-ptest/working/apache-github-source-source/hwi/target/tmp
    [mkdir] Created dir: /data/hive-ptest/working/apache-github-source-source/hwi/target/warehouse
    [mkdir] Created dir: /data/hive-ptest/working/apache-github-source-source/hwi/target/tmp/conf
     [copy] Copying 14 files to /data/hive-ptest/working/apache-github-source-source/hwi/target/tmp/conf
[INFO] Executed tasks
[INFO] 
[INFO] --- maven-compiler-plugin:3.1:testCompile (default-testCompile) @ hive-hwi ---
[INFO] Compiling 2 source files to /data/hive-ptest/working/apache-github-source-source/hwi/target/test-classes
[INFO] 
[INFO] --- maven-surefire-plugin:2.16:test (default-test) @ hive-hwi ---
[INFO] Tests are skipped.
[INFO] 
[INFO] --- maven-jar-plugin:2.2:jar (default-jar) @ hive-hwi ---
[INFO] Building jar: /data/hive-ptest/working/apache-github-source-source/hwi/target/hive-hwi-2.1.0-SNAPSHOT.jar
[INFO] 
[INFO] --- maven-site-plugin:3.3:attach-descriptor (attach-descriptor) @ hive-hwi ---
[INFO] 
[INFO] --- maven-install-plugin:2.4:install (default-install) @ hive-hwi ---
[INFO] Installing /data/hive-ptest/working/apache-github-source-source/hwi/target/hive-hwi-2.1.0-SNAPSHOT.jar
to /data/hive-ptest/working/maven/org/apache/hive/hive-hwi/2.1.0-SNAPSHOT/hive-hwi-2.1.0-SNAPSHOT.jar
[INFO] Installing /data/hive-ptest/working/apache-github-source-source/hwi/pom.xml to /data/hive-ptest/working/maven/org/apache/hive/hive-hwi/2.1.0-SNAPSHOT/hive-hwi-2.1.0-SNAPSHOT.pom
[INFO]                                                                         
[INFO] ------------------------------------------------------------------------
[INFO] Building Hive ODBC 2.1.0-SNAPSHOT
[INFO] ------------------------------------------------------------------------
[INFO] 
[INFO] --- maven-clean-plugin:2.5:clean (default-clean) @ hive-odbc ---
[INFO] Deleting /data/hive-ptest/working/apache-github-source-source/odbc/target
[INFO] Deleting /data/hive-ptest/working/apache-github-source-source/odbc (includes = [datanucleus.log,
derby.log], excludes = [])
[INFO] 
[INFO] --- maven-enforcer-plugin:1.3.1:enforce (enforce-no-snapshots) @ hive-odbc ---
[INFO] 
[INFO] --- maven-remote-resources-plugin:1.5:process (default) @ hive-odbc ---
[INFO] 
[INFO] --- maven-antrun-plugin:1.7:run (define-classpath) @ hive-odbc ---
[INFO] Executing tasks

main:
[INFO] Executed tasks
[INFO] 
[INFO] --- maven-antrun-plugin:1.7:run (setup-test-dirs) @ hive-odbc ---
[INFO] Executing tasks

main:
    [mkdir] Created dir: /data/hive-ptest/working/apache-github-source-source/odbc/target/tmp
    [mkdir] Created dir: /data/hive-ptest/working/apache-github-source-source/odbc/target/warehouse
    [mkdir] Created dir: /data/hive-ptest/working/apache-github-source-source/odbc/target/tmp/conf
     [copy] Copying 14 files to /data/hive-ptest/working/apache-github-source-source/odbc/target/tmp/conf
[INFO] Executed tasks
[INFO] 
[INFO] --- maven-site-plugin:3.3:attach-descriptor (attach-descriptor) @ hive-odbc ---
[INFO] 
[INFO] --- maven-install-plugin:2.4:install (default-install) @ hive-odbc ---
[INFO] Installing /data/hive-ptest/working/apache-github-source-source/odbc/pom.xml to /data/hive-ptest/working/maven/org/apache/hive/hive-odbc/2.1.0-SNAPSHOT/hive-odbc-2.1.0-SNAPSHOT.pom
[INFO]                                                                         
[INFO] ------------------------------------------------------------------------
[INFO] Building Hive Llap Server 2.1.0-SNAPSHOT
[INFO] ------------------------------------------------------------------------
[INFO] 
[INFO] --- maven-clean-plugin:2.5:clean (default-clean) @ hive-llap-server ---
[INFO] Deleting /data/hive-ptest/working/apache-github-source-source/llap-server/target
[INFO] Deleting /data/hive-ptest/working/apache-github-source-source/llap-server (includes
= [datanucleus.log, derby.log], excludes = [])
[INFO] 
[INFO] --- maven-enforcer-plugin:1.3.1:enforce (enforce-no-snapshots) @ hive-llap-server ---
[INFO] 
[INFO] --- build-helper-maven-plugin:1.8:add-source (add-source) @ hive-llap-server ---
[INFO] Source directory: /data/hive-ptest/working/apache-github-source-source/llap-server/src/gen/protobuf/gen-java
added.
[INFO] Source directory: /data/hive-ptest/working/apache-github-source-source/llap-server/src/gen/thrift/gen-javabean
added.
[INFO] 
[INFO] --- maven-remote-resources-plugin:1.5:process (default) @ hive-llap-server ---
[INFO] 
[INFO] --- maven-resources-plugin:2.6:resources (default-resources) @ hive-llap-server ---
[INFO] Using 'UTF-8' encoding to copy filtered resources.
[INFO] Copying 4 resources
[INFO] Copying 3 resources
[INFO] 
[INFO] --- maven-antrun-plugin:1.7:run (define-classpath) @ hive-llap-server ---
[INFO] Executing tasks

main:
[INFO] Executed tasks
[INFO] 
[INFO] --- maven-compiler-plugin:3.1:compile (default-compile) @ hive-llap-server ---
[INFO] Compiling 100 source files to /data/hive-ptest/working/apache-github-source-source/llap-server/target/classes
[INFO] -------------------------------------------------------------
[WARNING] COMPILATION WARNING : 
[INFO] -------------------------------------------------------------
[WARNING] /data/hive-ptest/working/apache-github-source-source/llap-server/src/java/org/apache/hadoop/hive/llap/daemon/impl/TaskRunnerCallable.java:
/data/hive-ptest/working/apache-github-source-source/llap-server/src/java/org/apache/hadoop/hive/llap/daemon/impl/TaskRunnerCallable.java
uses or overrides a deprecated API.
[WARNING] /data/hive-ptest/working/apache-github-source-source/llap-server/src/java/org/apache/hadoop/hive/llap/daemon/impl/TaskRunnerCallable.java:
Recompile with -Xlint:deprecation for details.
[WARNING] /data/hive-ptest/working/apache-github-source-source/llap-server/src/java/org/apache/hadoop/hive/llap/shufflehandler/DirWatcher.java:
Some input files use unchecked or unsafe operations.
[WARNING] /data/hive-ptest/working/apache-github-source-source/llap-server/src/java/org/apache/hadoop/hive/llap/shufflehandler/DirWatcher.java:
Recompile with -Xlint:unchecked for details.
[INFO] 4 warnings 
[INFO] -------------------------------------------------------------
[INFO] -------------------------------------------------------------
[ERROR] COMPILATION ERROR : 
[INFO] -------------------------------------------------------------
[ERROR] /data/hive-ptest/working/apache-github-source-source/llap-server/src/java/org/apache/hadoop/hive/llap/cli/LlapOptionsProcessor.java:[96,14]
cannot find symbol
  symbol:   variable jar
  location: class org.apache.hadoop.hive.llap.cli.LlapOptionsProcessor.LlapOptions
[INFO] 1 error
[INFO] -------------------------------------------------------------
[INFO] ------------------------------------------------------------------------
[INFO] Reactor Summary:
[INFO] 
[INFO] Hive .............................................. SUCCESS [13.258s]
[INFO] Hive Shims Common ................................. SUCCESS [15.354s]
[INFO] Hive Shims 0.23 ................................... SUCCESS [13.013s]
[INFO] Hive Shims Scheduler .............................. SUCCESS [4.055s]
[INFO] Hive Shims ........................................ SUCCESS [2.530s]
[INFO] Hive Storage API .................................. SUCCESS [5.588s]
[INFO] Hive Common ....................................... SUCCESS [24.182s]
[INFO] Hive Serde ........................................ SUCCESS [15.354s]
[INFO] Hive Metastore .................................... SUCCESS [52.502s]
[INFO] Hive Ant Utilities ................................ SUCCESS [1.701s]
[INFO] Hive Llap Client .................................. SUCCESS [11.956s]
[INFO] Spark Remote Client ............................... SUCCESS [21.684s]
[INFO] Hive Query Language ............................... SUCCESS [2:28.392s]
[INFO] Hive Service ...................................... SUCCESS [9.649s]
[INFO] Hive Accumulo Handler ............................. SUCCESS [6.992s]
[INFO] Hive JDBC ......................................... SUCCESS [16.889s]
[INFO] Hive Beeline ...................................... SUCCESS [3.471s]
[INFO] Hive CLI .......................................... SUCCESS [2.353s]
[INFO] Hive Contrib ...................................... SUCCESS [2.025s]
[INFO] Hive HBase Handler ................................ SUCCESS [5.474s]
[INFO] Hive HCatalog ..................................... SUCCESS [0.815s]
[INFO] Hive HCatalog Core ................................ SUCCESS [4.434s]
[INFO] Hive HCatalog Pig Adapter ......................... SUCCESS [3.712s]
[INFO] Hive HCatalog Server Extensions ................... SUCCESS [2.966s]
[INFO] Hive HCatalog Webhcat Java Client ................. SUCCESS [2.734s]
[INFO] Hive HCatalog Webhcat ............................. SUCCESS [14.087s]
[INFO] Hive HCatalog Streaming ........................... SUCCESS [3.145s]
[INFO] Hive HPL/SQL ...................................... SUCCESS [17.394s]
[INFO] Hive HWI .......................................... SUCCESS [1.477s]
[INFO] Hive ODBC ......................................... SUCCESS [1.786s]
[INFO] Hive Llap Server .................................. FAILURE [6.019s]
[INFO] Hive Shims Aggregator ............................. SKIPPED
[INFO] Hive TestUtils .................................... SKIPPED
[INFO] Hive Packaging .................................... SKIPPED
[INFO] ------------------------------------------------------------------------
[INFO] BUILD FAILURE
[INFO] ------------------------------------------------------------------------
[INFO] Total time: 7:17.965s
[INFO] Finished at: Thu Dec 10 08:51:59 EST 2015
[INFO] Final Memory: 214M/1095M
[INFO] ------------------------------------------------------------------------
[WARNING] The requested profile "hadoop-2" could not be activated because it does not exist.
[ERROR] Failed to execute goal org.apache.maven.plugins:maven-compiler-plugin:3.1:compile
(default-compile) on project hive-llap-server: Compilation failure
[ERROR] /data/hive-ptest/working/apache-github-source-source/llap-server/src/java/org/apache/hadoop/hive/llap/cli/LlapOptionsProcessor.java:[96,14]
cannot find symbol
[ERROR] symbol:   variable jar
[ERROR] location: class org.apache.hadoop.hive.llap.cli.LlapOptionsProcessor.LlapOptions
[ERROR] -> [Help 1]
[ERROR] 
[ERROR] To see the full stack trace of the errors, re-run Maven with the -e switch.
[ERROR] Re-run Maven using the -X switch to enable full debug logging.
[ERROR] 
[ERROR] For more information about the errors and possible solutions, please read the following
articles:
[ERROR] [Help 1] http://cwiki.apache.org/confluence/display/MAVEN/MojoFailureException
[ERROR] 
[ERROR] After correcting the problems, you can resume the build with the command
[ERROR]   mvn <goals> -rf :hive-llap-server
+ exit 1
'
{noformat}

This message is automatically generated.

ATTACHMENT ID: 12776629 - PreCommit-HIVE-TRUNK-Build

> LLAP: package included serde jars
> ---------------------------------
>
>                 Key: HIVE-12633
>                 URL: https://issues.apache.org/jira/browse/HIVE-12633
>             Project: Hive
>          Issue Type: Bug
>            Reporter: Takahiko Saito
>            Assignee: Sergey Shelukhin
>         Attachments: HIVE-12633.patch
>
>
> Some SerDes like JSONSerde are not packaged with LLAP. One cannot localize jars on the
daemon (due to security consideration if nothing else), so we should package them.



--
This message was sent by Atlassian JIRA
(v6.3.4#6332)

Mime
View raw message