hive-issues mailing list archives

Site index · List index
Message view « Date » · « Thread »
Top « Date » · « Thread »
From "Hive QA (JIRA)" <j...@apache.org>
Subject [jira] [Commented] (HIVE-12378) Exception on HBaseSerDe.serialize binary field
Date Thu, 12 Nov 2015 23:33:11 GMT

    [ https://issues.apache.org/jira/browse/HIVE-12378?page=com.atlassian.jira.plugin.system.issuetabpanels:comment-tabpanel&focusedCommentId=15003198#comment-15003198
] 

Hive QA commented on HIVE-12378:
--------------------------------



Here are the results of testing the latest attachment:
https://issues.apache.org/jira/secure/attachment/12771987/HIVE-12378.1.patch

{color:green}SUCCESS:{color} +1 due to 1 test(s) being added or modified.

{color:red}ERROR:{color} -1 due to 4 failed/errored test(s), 9782 tests executed
*Failed tests:*
{noformat}
org.apache.hadoop.hive.cli.TestCliDriver.testCliDriver_cbo_rp_annotate_stats_groupby
org.apache.hadoop.hive.cli.TestNegativeCliDriver.testNegativeCliDriver_authorization_uri_import
org.apache.hadoop.hive.hwi.TestHWISessionManager.testHiveDriver
org.apache.hive.jdbc.TestSSL.testSSLVersion
{noformat}

Test results: http://ec2-174-129-184-35.compute-1.amazonaws.com/jenkins/job/PreCommit-HIVE-TRUNK-Build/6017/testReport
Console output: http://ec2-174-129-184-35.compute-1.amazonaws.com/jenkins/job/PreCommit-HIVE-TRUNK-Build/6017/console
Test logs: http://ec2-174-129-184-35.compute-1.amazonaws.com/logs/PreCommit-HIVE-TRUNK-Build-6017/

Messages:
{noformat}
Executing org.apache.hive.ptest.execution.TestCheckPhase
Executing org.apache.hive.ptest.execution.PrepPhase
Executing org.apache.hive.ptest.execution.ExecutionPhase
Executing org.apache.hive.ptest.execution.ReportingPhase
Tests exited with: TestsFailedException: 4 tests failed
{noformat}

This message is automatically generated.

ATTACHMENT ID: 12771987 - PreCommit-HIVE-TRUNK-Build

> Exception on HBaseSerDe.serialize binary field
> ----------------------------------------------
>
>                 Key: HIVE-12378
>                 URL: https://issues.apache.org/jira/browse/HIVE-12378
>             Project: Hive
>          Issue Type: Bug
>          Components: HBase Handler, Serializers/Deserializers
>    Affects Versions: 1.0.0, 1.1.0, 2.0.0
>            Reporter: Yongzhi Chen
>            Assignee: Yongzhi Chen
>         Attachments: HIVE-12378.1.patch
>
>
> An issue was reproduced with the binary typed HBase columns in Hive:
> It works fine as below:
> CREATE TABLE test9 (key int, val string)
> STORED BY 'org.apache.hadoop.hive.hbase.HBaseStorageHandler'
> WITH SERDEPROPERTIES (
> "hbase.columns.mapping" = ":key,cf:val#b"
> );
> insert into test9 values(1,"hello");
> But when string type is changed to binary as:
> CREATE TABLE test2 (key int, val binary)
> STORED BY 'org.apache.hadoop.hive.hbase.HBaseStorageHandler'
> WITH SERDEPROPERTIES (
> "hbase.columns.mapping" = ":key,cf:val#b"
> );
> insert into table test2 values(1, 'hello');
> The following exception is thrown:
> Caused by: org.apache.hadoop.hive.ql.metadata.HiveException: Hive Runtime Error while
processing row {"tmp_values_col1":"1","tmp_values_col2":"hello"}
> ...
> Caused by: java.lang.RuntimeException: Hive internal error.
> at org.apache.hadoop.hive.serde2.lazy.LazyUtils.writePrimitive(LazyUtils.java:322)
> at org.apache.hadoop.hive.hbase.HBaseRowSerializer.serialize(HBaseRowSerializer.java:220)
> at org.apache.hadoop.hive.hbase.HBaseRowSerializer.serializeField(HBaseRowSerializer.java:194)
> at org.apache.hadoop.hive.hbase.HBaseRowSerializer.serialize(HBaseRowSerializer.java:118)
> at org.apache.hadoop.hive.hbase.HBaseSerDe.serialize(HBaseSerDe.java:282)
> ... 16 more
> We should support hive binary type column for hbase.



--
This message was sent by Atlassian JIRA
(v6.3.4#6332)

Mime
View raw message