hive-issues mailing list archives

Site index · List index
Message view « Date » · « Thread »
Top « Date » · « Thread »
From "Hive QA (JIRA)" <j...@apache.org>
Subject [jira] [Commented] (HIVE-11835) Type decimal(1,1) reads 0.0, 0.00, etc from text file as NULL
Date Fri, 25 Sep 2015 20:04:04 GMT

    [ https://issues.apache.org/jira/browse/HIVE-11835?page=com.atlassian.jira.plugin.system.issuetabpanels:comment-tabpanel&focusedCommentId=14908585#comment-14908585
] 

Hive QA commented on HIVE-11835:
--------------------------------



{color:red}Overall{color}: -1 no tests executed

Here are the results of testing the latest attachment:
https://issues.apache.org/jira/secure/attachment/12762049/HIVE-11835.1.patch

Test results: http://ec2-174-129-184-35.compute-1.amazonaws.com/jenkins/job/PreCommit-HIVE-TRUNK-Build/5415/testReport
Console output: http://ec2-174-129-184-35.compute-1.amazonaws.com/jenkins/job/PreCommit-HIVE-TRUNK-Build/5415/console
Test logs: http://ec2-174-129-184-35.compute-1.amazonaws.com/logs/PreCommit-HIVE-TRUNK-Build-5415/

Messages:
{noformat}
**** This message was trimmed, see log for full details ****
main:
    [mkdir] Created dir: /data/hive-ptest/working/apache-github-source-source/storage-api/target/tmp
    [mkdir] Created dir: /data/hive-ptest/working/apache-github-source-source/storage-api/target/warehouse
    [mkdir] Created dir: /data/hive-ptest/working/apache-github-source-source/storage-api/target/tmp/conf
     [copy] Copying 10 files to /data/hive-ptest/working/apache-github-source-source/storage-api/target/tmp/conf
[INFO] Executed tasks
[INFO] 
[INFO] --- maven-compiler-plugin:3.1:testCompile (default-testCompile) @ hive-storage-api
---
[INFO] No sources to compile
[INFO] 
[INFO] --- maven-surefire-plugin:2.16:test (default-test) @ hive-storage-api ---
[INFO] Tests are skipped.
[INFO] 
[INFO] --- maven-jar-plugin:2.2:jar (default-jar) @ hive-storage-api ---
[INFO] Building jar: /data/hive-ptest/working/apache-github-source-source/storage-api/target/hive-storage-api-2.0.0-SNAPSHOT.jar
[INFO] 
[INFO] --- maven-site-plugin:3.3:attach-descriptor (attach-descriptor) @ hive-storage-api
---
[INFO] 
[INFO] --- maven-install-plugin:2.4:install (default-install) @ hive-storage-api ---
[INFO] Installing /data/hive-ptest/working/apache-github-source-source/storage-api/target/hive-storage-api-2.0.0-SNAPSHOT.jar
to /home/hiveptest/.m2/repository/org/apache/hive/hive-storage-api/2.0.0-SNAPSHOT/hive-storage-api-2.0.0-SNAPSHOT.jar
[INFO] Installing /data/hive-ptest/working/apache-github-source-source/storage-api/pom.xml
to /home/hiveptest/.m2/repository/org/apache/hive/hive-storage-api/2.0.0-SNAPSHOT/hive-storage-api-2.0.0-SNAPSHOT.pom
[INFO]                                                                         
[INFO] ------------------------------------------------------------------------
[INFO] Building Hive Common 2.0.0-SNAPSHOT
[INFO] ------------------------------------------------------------------------
[INFO] 
[INFO] --- maven-clean-plugin:2.5:clean (default-clean) @ hive-common ---
[INFO] Deleting /data/hive-ptest/working/apache-github-source-source/common/target
[INFO] Deleting /data/hive-ptest/working/apache-github-source-source/common (includes = [datanucleus.log,
derby.log], excludes = [])
[INFO] 
[INFO] --- maven-enforcer-plugin:1.3.1:enforce (enforce-no-snapshots) @ hive-common ---
[INFO] 
[INFO] --- maven-antrun-plugin:1.7:run (generate-version-annotation) @ hive-common ---
[INFO] Executing tasks

main:
[INFO] Executed tasks
[INFO] 
[INFO] --- build-helper-maven-plugin:1.8:add-source (add-source) @ hive-common ---
[INFO] Source directory: /data/hive-ptest/working/apache-github-source-source/common/src/gen
added.
[INFO] 
[INFO] --- maven-remote-resources-plugin:1.5:process (default) @ hive-common ---
[INFO] 
[INFO] --- maven-resources-plugin:2.6:resources (default-resources) @ hive-common ---
[INFO] Using 'UTF-8' encoding to copy filtered resources.
[INFO] Copying 1 resource
[INFO] Copying 3 resources
[INFO] 
[INFO] --- maven-antrun-plugin:1.7:run (define-classpath) @ hive-common ---
[INFO] Executing tasks

main:
[INFO] Executed tasks
[INFO] 
[INFO] --- maven-compiler-plugin:3.1:compile (default-compile) @ hive-common ---
[INFO] Compiling 77 source files to /data/hive-ptest/working/apache-github-source-source/common/target/classes
[WARNING] /data/hive-ptest/working/apache-github-source-source/common/src/java/org/apache/hadoop/hive/common/JvmPauseMonitor.java:
/data/hive-ptest/working/apache-github-source-source/common/src/java/org/apache/hadoop/hive/common/JvmPauseMonitor.java
uses or overrides a deprecated API.
[WARNING] /data/hive-ptest/working/apache-github-source-source/common/src/java/org/apache/hadoop/hive/common/JvmPauseMonitor.java:
Recompile with -Xlint:deprecation for details.
[WARNING] /data/hive-ptest/working/apache-github-source-source/common/src/java/org/apache/hadoop/hive/common/ObjectPair.java:
Some input files use unchecked or unsafe operations.
[WARNING] /data/hive-ptest/working/apache-github-source-source/common/src/java/org/apache/hadoop/hive/common/ObjectPair.java:
Recompile with -Xlint:unchecked for details.
[INFO] 
[INFO] --- maven-resources-plugin:2.6:testResources (default-testResources) @ hive-common
---
[INFO] Using 'UTF-8' encoding to copy filtered resources.
[INFO] Copying 4 resources
[INFO] Copying 3 resources
[INFO] 
[INFO] --- maven-antrun-plugin:1.7:run (setup-test-dirs) @ hive-common ---
[INFO] Executing tasks

main:
    [mkdir] Created dir: /data/hive-ptest/working/apache-github-source-source/common/target/tmp
    [mkdir] Created dir: /data/hive-ptest/working/apache-github-source-source/common/target/warehouse
    [mkdir] Created dir: /data/hive-ptest/working/apache-github-source-source/common/target/tmp/conf
     [copy] Copying 10 files to /data/hive-ptest/working/apache-github-source-source/common/target/tmp/conf
[INFO] Executed tasks
[INFO] 
[INFO] --- maven-compiler-plugin:3.1:testCompile (default-testCompile) @ hive-common ---
[INFO] Compiling 21 source files to /data/hive-ptest/working/apache-github-source-source/common/target/test-classes
[WARNING] /data/hive-ptest/working/apache-github-source-source/common/src/test/org/apache/hadoop/hive/common/TestValidReadTxnList.java:
/data/hive-ptest/working/apache-github-source-source/common/src/test/org/apache/hadoop/hive/common/TestValidReadTxnList.java
uses or overrides a deprecated API.
[WARNING] /data/hive-ptest/working/apache-github-source-source/common/src/test/org/apache/hadoop/hive/common/TestValidReadTxnList.java:
Recompile with -Xlint:deprecation for details.
[INFO] 
[INFO] --- maven-surefire-plugin:2.16:test (default-test) @ hive-common ---
[INFO] Tests are skipped.
[INFO] 
[INFO] --- maven-jar-plugin:2.2:jar (default-jar) @ hive-common ---
[INFO] Building jar: /data/hive-ptest/working/apache-github-source-source/common/target/hive-common-2.0.0-SNAPSHOT.jar
[INFO] 
[INFO] --- maven-site-plugin:3.3:attach-descriptor (attach-descriptor) @ hive-common ---
[INFO] 
[INFO] --- maven-install-plugin:2.4:install (default-install) @ hive-common ---
[INFO] Installing /data/hive-ptest/working/apache-github-source-source/common/target/hive-common-2.0.0-SNAPSHOT.jar
to /home/hiveptest/.m2/repository/org/apache/hive/hive-common/2.0.0-SNAPSHOT/hive-common-2.0.0-SNAPSHOT.jar
[INFO] Installing /data/hive-ptest/working/apache-github-source-source/common/pom.xml to /home/hiveptest/.m2/repository/org/apache/hive/hive-common/2.0.0-SNAPSHOT/hive-common-2.0.0-SNAPSHOT.pom
[INFO]                                                                         
[INFO] ------------------------------------------------------------------------
[INFO] Building Hive Serde 2.0.0-SNAPSHOT
[INFO] ------------------------------------------------------------------------
[INFO] 
[INFO] --- maven-clean-plugin:2.5:clean (default-clean) @ hive-serde ---
[INFO] Deleting /data/hive-ptest/working/apache-github-source-source/serde/target
[INFO] Deleting /data/hive-ptest/working/apache-github-source-source/serde (includes = [datanucleus.log,
derby.log], excludes = [])
[INFO] 
[INFO] --- maven-enforcer-plugin:1.3.1:enforce (enforce-no-snapshots) @ hive-serde ---
[INFO] 
[INFO] --- build-helper-maven-plugin:1.8:add-source (add-source) @ hive-serde ---
[INFO] Source directory: /data/hive-ptest/working/apache-github-source-source/serde/src/gen/protobuf/gen-java
added.
[INFO] Source directory: /data/hive-ptest/working/apache-github-source-source/serde/src/gen/thrift/gen-javabean
added.
[INFO] 
[INFO] --- maven-remote-resources-plugin:1.5:process (default) @ hive-serde ---
[INFO] 
[INFO] --- maven-resources-plugin:2.6:resources (default-resources) @ hive-serde ---
[INFO] Using 'UTF-8' encoding to copy filtered resources.
[INFO] skip non existing resourceDirectory /data/hive-ptest/working/apache-github-source-source/serde/src/main/resources
[INFO] Copying 3 resources
[INFO] 
[INFO] --- maven-antrun-plugin:1.7:run (define-classpath) @ hive-serde ---
[INFO] Executing tasks

main:
[INFO] Executed tasks
[INFO] 
[INFO] --- maven-compiler-plugin:3.1:compile (default-compile) @ hive-serde ---
[INFO] Compiling 406 source files to /data/hive-ptest/working/apache-github-source-source/serde/target/classes
[INFO] -------------------------------------------------------------
[WARNING] COMPILATION WARNING : 
[INFO] -------------------------------------------------------------
[WARNING] /data/hive-ptest/working/apache-github-source-source/serde/src/java/org/apache/hadoop/hive/serde2/SerDe.java:
Some input files use or override a deprecated API.
[WARNING] /data/hive-ptest/working/apache-github-source-source/serde/src/java/org/apache/hadoop/hive/serde2/SerDe.java:
Recompile with -Xlint:deprecation for details.
[WARNING] /data/hive-ptest/working/apache-github-source-source/serde/src/java/org/apache/hadoop/hive/serde2/objectinspector/StandardStructObjectInspector.java:
Some input files use unchecked or unsafe operations.
[WARNING] /data/hive-ptest/working/apache-github-source-source/serde/src/java/org/apache/hadoop/hive/serde2/objectinspector/StandardStructObjectInspector.java:
Recompile with -Xlint:unchecked for details.
[INFO] 4 warnings 
[INFO] -------------------------------------------------------------
[INFO] -------------------------------------------------------------
[ERROR] COMPILATION ERROR : 
[INFO] -------------------------------------------------------------
[ERROR] /data/hive-ptest/working/apache-github-source-source/serde/src/java/org/apache/hadoop/hive/serde2/lazy/fast/LazySimpleSerializeWrite.java:[515,20]
method writeUTF8 in class org.apache.hadoop.hive.serde2.lazy.LazyHiveDecimal cannot be applied
to given types;
  required: java.io.OutputStream,org.apache.hadoop.hive.common.type.HiveDecimal,int
  found: org.apache.hadoop.hive.serde2.ByteStream.Output,org.apache.hadoop.hive.common.type.HiveDecimal
  reason: actual and formal argument lists differ in length
[INFO] 1 error
[INFO] -------------------------------------------------------------
[INFO] ------------------------------------------------------------------------
[INFO] Reactor Summary:
[INFO] 
[INFO] Hive .............................................. SUCCESS [9.320s]
[INFO] Hive Shims Common ................................. SUCCESS [14.221s]
[INFO] Hive Shims 0.20S .................................. SUCCESS [3.566s]
[INFO] Hive Shims 0.23 ................................... SUCCESS [10.366s]
[INFO] Hive Shims Scheduler .............................. SUCCESS [2.478s]
[INFO] Hive Shims ........................................ SUCCESS [3.198s]
[INFO] Hive Storage API .................................. SUCCESS [2.837s]
[INFO] Hive Common ....................................... SUCCESS [21.542s]
[INFO] Hive Serde ........................................ FAILURE [13.144s]
[INFO] Hive Metastore .................................... SKIPPED
[INFO] Hive Ant Utilities ................................ SKIPPED
[INFO] Spark Remote Client ............................... SKIPPED
[INFO] Hive Query Language ............................... SKIPPED
[INFO] Hive Service ...................................... SKIPPED
[INFO] Hive Accumulo Handler ............................. SKIPPED
[INFO] Hive JDBC ......................................... SKIPPED
[INFO] Hive Beeline ...................................... SKIPPED
[INFO] Hive CLI .......................................... SKIPPED
[INFO] Hive Contrib ...................................... SKIPPED
[INFO] Hive HBase Handler ................................ SKIPPED
[INFO] Hive HCatalog ..................................... SKIPPED
[INFO] Hive HCatalog Core ................................ SKIPPED
[INFO] Hive HCatalog Pig Adapter ......................... SKIPPED
[INFO] Hive HCatalog Server Extensions ................... SKIPPED
[INFO] Hive HCatalog Webhcat Java Client ................. SKIPPED
[INFO] Hive HCatalog Webhcat ............................. SKIPPED
[INFO] Hive HCatalog Streaming ........................... SKIPPED
[INFO] Hive HPL/SQL ...................................... SKIPPED
[INFO] Hive HWI .......................................... SKIPPED
[INFO] Hive ODBC ......................................... SKIPPED
[INFO] Hive Shims Aggregator ............................. SKIPPED
[INFO] Hive TestUtils .................................... SKIPPED
[INFO] Hive Packaging .................................... SKIPPED
[INFO] ------------------------------------------------------------------------
[INFO] BUILD FAILURE
[INFO] ------------------------------------------------------------------------
[INFO] Total time: 1:23.756s
[INFO] Finished at: Fri Sep 25 16:03:02 EDT 2015
[INFO] Final Memory: 49M/218M
[INFO] ------------------------------------------------------------------------
[ERROR] Failed to execute goal org.apache.maven.plugins:maven-compiler-plugin:3.1:compile
(default-compile) on project hive-serde: Compilation failure
[ERROR] /data/hive-ptest/working/apache-github-source-source/serde/src/java/org/apache/hadoop/hive/serde2/lazy/fast/LazySimpleSerializeWrite.java:[515,20]
method writeUTF8 in class org.apache.hadoop.hive.serde2.lazy.LazyHiveDecimal cannot be applied
to given types;
[ERROR] required: java.io.OutputStream,org.apache.hadoop.hive.common.type.HiveDecimal,int
[ERROR] found: org.apache.hadoop.hive.serde2.ByteStream.Output,org.apache.hadoop.hive.common.type.HiveDecimal
[ERROR] reason: actual and formal argument lists differ in length
[ERROR] -> [Help 1]
[ERROR] 
[ERROR] To see the full stack trace of the errors, re-run Maven with the -e switch.
[ERROR] Re-run Maven using the -X switch to enable full debug logging.
[ERROR] 
[ERROR] For more information about the errors and possible solutions, please read the following
articles:
[ERROR] [Help 1] http://cwiki.apache.org/confluence/display/MAVEN/MojoFailureException
[ERROR] 
[ERROR] After correcting the problems, you can resume the build with the command
[ERROR]   mvn <goals> -rf :hive-serde
+ exit 1
'
{noformat}

This message is automatically generated.

ATTACHMENT ID: 12762049 - PreCommit-HIVE-TRUNK-Build

> Type decimal(1,1) reads 0.0, 0.00, etc from text file as NULL
> -------------------------------------------------------------
>
>                 Key: HIVE-11835
>                 URL: https://issues.apache.org/jira/browse/HIVE-11835
>             Project: Hive
>          Issue Type: Bug
>          Components: Types
>    Affects Versions: 1.2.0, 1.1.0, 2.0.0
>            Reporter: Xuefu Zhang
>            Assignee: Xuefu Zhang
>         Attachments: HIVE-11835.1.patch, HIVE-11835.patch
>
>
> Steps to reproduce:
> 1. create a text file with values like 0.0, 0.00, etc.
> 2. create table in hive with type decimal(1,1).
> 3. run "load data local inpath ..." to load data into the table.
> 4. run select * on the table.
> You will see that NULL is displayed for 0.0, 0.00, .0, etc. Instead, these should be
read as 0.0.



--
This message was sent by Atlassian JIRA
(v6.3.4#6332)

Mime
View raw message