hive-issues mailing list archives

Site index · List index
Message view « Date » · « Thread »
Top « Date » · « Thread »
From "Hive QA (JIRA)" <j...@apache.org>
Subject [jira] [Commented] (HIVE-11711) Merge hbase-metastore branch to trunk
Date Thu, 03 Sep 2015 19:38:46 GMT

    [ https://issues.apache.org/jira/browse/HIVE-11711?page=com.atlassian.jira.plugin.system.issuetabpanels:comment-tabpanel&focusedCommentId=14729649#comment-14729649
] 

Hive QA commented on HIVE-11711:
--------------------------------



{color:red}Overall{color}: -1 no tests executed

Here are the results of testing the latest attachment:
https://issues.apache.org/jira/secure/attachment/12754032/HIVE-11711.2.patch

Test results: http://ec2-174-129-184-35.compute-1.amazonaws.com/jenkins/job/PreCommit-HIVE-TRUNK-Build/5167/testReport
Console output: http://ec2-174-129-184-35.compute-1.amazonaws.com/jenkins/job/PreCommit-HIVE-TRUNK-Build/5167/console
Test logs: http://ec2-174-129-184-35.compute-1.amazonaws.com/logs/PreCommit-HIVE-TRUNK-Build-5167/

Messages:
{noformat}
**** This message was trimmed, see log for full details ****
[WARNING] /data/hive-ptest/working/apache-github-source-source/itests/custom-serde/src/main/java/org/apache/hadoop/hive/serde2/CustomSerDe2.java:
Some input files use or override a deprecated API.
[WARNING] /data/hive-ptest/working/apache-github-source-source/itests/custom-serde/src/main/java/org/apache/hadoop/hive/serde2/CustomSerDe2.java:
Recompile with -Xlint:deprecation for details.
[INFO] 
[INFO] --- maven-resources-plugin:2.6:testResources (default-testResources) @ hive-it-custom-serde
---
[INFO] Using 'UTF-8' encoding to copy filtered resources.
[INFO] skip non existing resourceDirectory /data/hive-ptest/working/apache-github-source-source/itests/custom-serde/src/test/resources
[INFO] Copying 3 resources
[INFO] 
[INFO] --- maven-antrun-plugin:1.7:run (setup-test-dirs) @ hive-it-custom-serde ---
[INFO] Executing tasks

main:
    [mkdir] Created dir: /data/hive-ptest/working/apache-github-source-source/itests/custom-serde/target/tmp
    [mkdir] Created dir: /data/hive-ptest/working/apache-github-source-source/itests/custom-serde/target/warehouse
    [mkdir] Created dir: /data/hive-ptest/working/apache-github-source-source/itests/custom-serde/target/tmp/conf
     [copy] Copying 10 files to /data/hive-ptest/working/apache-github-source-source/itests/custom-serde/target/tmp/conf
[INFO] Executed tasks
[INFO] 
[INFO] --- maven-compiler-plugin:3.1:testCompile (default-testCompile) @ hive-it-custom-serde
---
[INFO] No sources to compile
[INFO] 
[INFO] --- maven-surefire-plugin:2.16:test (default-test) @ hive-it-custom-serde ---
[INFO] Tests are skipped.
[INFO] 
[INFO] --- maven-jar-plugin:2.2:jar (default-jar) @ hive-it-custom-serde ---
[INFO] Building jar: /data/hive-ptest/working/apache-github-source-source/itests/custom-serde/target/hive-it-custom-serde-2.0.0-SNAPSHOT.jar
[INFO] 
[INFO] --- maven-site-plugin:3.3:attach-descriptor (attach-descriptor) @ hive-it-custom-serde
---
[INFO] 
[INFO] --- maven-install-plugin:2.4:install (default-install) @ hive-it-custom-serde ---
[INFO] Installing /data/hive-ptest/working/apache-github-source-source/itests/custom-serde/target/hive-it-custom-serde-2.0.0-SNAPSHOT.jar
to /home/hiveptest/.m2/repository/org/apache/hive/hive-it-custom-serde/2.0.0-SNAPSHOT/hive-it-custom-serde-2.0.0-SNAPSHOT.jar
[INFO] Installing /data/hive-ptest/working/apache-github-source-source/itests/custom-serde/pom.xml
to /home/hiveptest/.m2/repository/org/apache/hive/hive-it-custom-serde/2.0.0-SNAPSHOT/hive-it-custom-serde-2.0.0-SNAPSHOT.pom
[INFO]                                                                         
[INFO] ------------------------------------------------------------------------
[INFO] Building Hive Integration - HCatalog Unit Tests 2.0.0-SNAPSHOT
[INFO] ------------------------------------------------------------------------
[INFO] 
[INFO] --- maven-clean-plugin:2.5:clean (default-clean) @ hive-hcatalog-it-unit ---
[INFO] Deleting /data/hive-ptest/working/apache-github-source-source/itests/hcatalog-unit/target
[INFO] Deleting /data/hive-ptest/working/apache-github-source-source/itests/hcatalog-unit
(includes = [datanucleus.log, derby.log], excludes = [])
[INFO] 
[INFO] --- maven-enforcer-plugin:1.3.1:enforce (enforce-no-snapshots) @ hive-hcatalog-it-unit
---
[INFO] 
[INFO] --- maven-antrun-plugin:1.7:run (download-spark) @ hive-hcatalog-it-unit ---
[INFO] Executing tasks

main:
[INFO] Executed tasks
[INFO] 
[INFO] --- maven-remote-resources-plugin:1.5:process (default) @ hive-hcatalog-it-unit ---
[INFO] 
[INFO] --- maven-resources-plugin:2.6:resources (default-resources) @ hive-hcatalog-it-unit
---
[INFO] Using 'UTF-8' encoding to copy filtered resources.
[INFO] skip non existing resourceDirectory /data/hive-ptest/working/apache-github-source-source/itests/hcatalog-unit/src/main/resources
[INFO] Copying 3 resources
[INFO] 
[INFO] --- maven-antrun-plugin:1.7:run (define-classpath) @ hive-hcatalog-it-unit ---
[INFO] Executing tasks

main:
[INFO] Executed tasks
[INFO] 
[INFO] --- maven-compiler-plugin:3.1:compile (default-compile) @ hive-hcatalog-it-unit ---
[INFO] No sources to compile
[INFO] 
[INFO] --- maven-resources-plugin:2.6:testResources (default-testResources) @ hive-hcatalog-it-unit
---
[INFO] Using 'UTF-8' encoding to copy filtered resources.
[INFO] skip non existing resourceDirectory /data/hive-ptest/working/apache-github-source-source/itests/hcatalog-unit/src/test/resources
[INFO] Copying 3 resources
[INFO] 
[INFO] --- maven-antrun-plugin:1.7:run (setup-test-dirs) @ hive-hcatalog-it-unit ---
[INFO] Executing tasks

main:
    [mkdir] Created dir: /data/hive-ptest/working/apache-github-source-source/itests/hcatalog-unit/target/tmp
    [mkdir] Created dir: /data/hive-ptest/working/apache-github-source-source/itests/hcatalog-unit/target/warehouse
    [mkdir] Created dir: /data/hive-ptest/working/apache-github-source-source/itests/hcatalog-unit/target/tmp/conf
     [copy] Copying 10 files to /data/hive-ptest/working/apache-github-source-source/itests/hcatalog-unit/target/tmp/conf
[INFO] Executed tasks
[INFO] 
[INFO] --- maven-compiler-plugin:3.1:testCompile (default-testCompile) @ hive-hcatalog-it-unit
---
[INFO] Compiling 8 source files to /data/hive-ptest/working/apache-github-source-source/itests/hcatalog-unit/target/test-classes
[WARNING] /data/hive-ptest/working/apache-github-source-source/itests/hcatalog-unit/src/test/java/org/apache/hive/hcatalog/api/TestHCatClientNotification.java:
Some input files use or override a deprecated API.
[WARNING] /data/hive-ptest/working/apache-github-source-source/itests/hcatalog-unit/src/test/java/org/apache/hive/hcatalog/api/TestHCatClientNotification.java:
Recompile with -Xlint:deprecation for details.
[INFO] 
[INFO] --- maven-surefire-plugin:2.16:test (default-test) @ hive-hcatalog-it-unit ---
[INFO] Tests are skipped.
[INFO] 
[INFO] --- maven-jar-plugin:2.2:jar (default-jar) @ hive-hcatalog-it-unit ---
[INFO] Building jar: /data/hive-ptest/working/apache-github-source-source/itests/hcatalog-unit/target/hive-hcatalog-it-unit-2.0.0-SNAPSHOT.jar
[INFO] 
[INFO] --- maven-site-plugin:3.3:attach-descriptor (attach-descriptor) @ hive-hcatalog-it-unit
---
[INFO] 
[INFO] --- maven-jar-plugin:2.2:test-jar (default) @ hive-hcatalog-it-unit ---
[INFO] Building jar: /data/hive-ptest/working/apache-github-source-source/itests/hcatalog-unit/target/hive-hcatalog-it-unit-2.0.0-SNAPSHOT-tests.jar
[INFO] 
[INFO] --- maven-install-plugin:2.4:install (default-install) @ hive-hcatalog-it-unit ---
[INFO] Installing /data/hive-ptest/working/apache-github-source-source/itests/hcatalog-unit/target/hive-hcatalog-it-unit-2.0.0-SNAPSHOT.jar
to /home/hiveptest/.m2/repository/org/apache/hive/hive-hcatalog-it-unit/2.0.0-SNAPSHOT/hive-hcatalog-it-unit-2.0.0-SNAPSHOT.jar
[INFO] Installing /data/hive-ptest/working/apache-github-source-source/itests/hcatalog-unit/pom.xml
to /home/hiveptest/.m2/repository/org/apache/hive/hive-hcatalog-it-unit/2.0.0-SNAPSHOT/hive-hcatalog-it-unit-2.0.0-SNAPSHOT.pom
[INFO] Installing /data/hive-ptest/working/apache-github-source-source/itests/hcatalog-unit/target/hive-hcatalog-it-unit-2.0.0-SNAPSHOT-tests.jar
to /home/hiveptest/.m2/repository/org/apache/hive/hive-hcatalog-it-unit/2.0.0-SNAPSHOT/hive-hcatalog-it-unit-2.0.0-SNAPSHOT-tests.jar
[INFO]                                                                         
[INFO] ------------------------------------------------------------------------
[INFO] Building Hive Integration - Testing Utilities 2.0.0-SNAPSHOT
[INFO] ------------------------------------------------------------------------
[INFO] 
[INFO] --- maven-clean-plugin:2.5:clean (default-clean) @ hive-it-util ---
[INFO] Deleting /data/hive-ptest/working/apache-github-source-source/itests/util/target
[INFO] Deleting /data/hive-ptest/working/apache-github-source-source/itests/util (includes
= [datanucleus.log, derby.log], excludes = [])
[INFO] 
[INFO] --- maven-enforcer-plugin:1.3.1:enforce (enforce-no-snapshots) @ hive-it-util ---
[INFO] 
[INFO] --- maven-antrun-plugin:1.7:run (download-spark) @ hive-it-util ---
[INFO] Executing tasks

main:
[INFO] Executed tasks
[INFO] 
[INFO] --- maven-remote-resources-plugin:1.5:process (default) @ hive-it-util ---
[WARNING] Invalid project model for artifact [pentaho-aggdesigner-algorithm:org.pentaho:5.1.5-jhyde].
It will be ignored by the remote resources Mojo.
[INFO] 
[INFO] --- maven-resources-plugin:2.6:resources (default-resources) @ hive-it-util ---
[INFO] Using 'UTF-8' encoding to copy filtered resources.
[INFO] skip non existing resourceDirectory /data/hive-ptest/working/apache-github-source-source/itests/util/src/main/resources
[INFO] Copying 3 resources
[INFO] 
[INFO] --- maven-antrun-plugin:1.7:run (define-classpath) @ hive-it-util ---
[INFO] Executing tasks

main:
[INFO] Executed tasks
[INFO] 
[INFO] --- maven-compiler-plugin:3.1:compile (default-compile) @ hive-it-util ---
[INFO] Compiling 50 source files to /data/hive-ptest/working/apache-github-source-source/itests/util/target/classes
[INFO] -------------------------------------------------------------
[WARNING] COMPILATION WARNING : 
[INFO] -------------------------------------------------------------
[WARNING] /data/hive-ptest/working/apache-github-source-source/itests/util/src/main/java/org/apache/hadoop/hive/ql/QTestUtil.java:
Some input files use or override a deprecated API.
[WARNING] /data/hive-ptest/working/apache-github-source-source/itests/util/src/main/java/org/apache/hadoop/hive/ql/QTestUtil.java:
Recompile with -Xlint:deprecation for details.
[INFO] 2 warnings 
[INFO] -------------------------------------------------------------
[INFO] -------------------------------------------------------------
[ERROR] COMPILATION ERROR : 
[INFO] -------------------------------------------------------------
[ERROR] /data/hive-ptest/working/apache-github-source-source/itests/util/src/main/java/org/apache/hadoop/hive/ql/QTestUtil.java:[86,46]
package org.apache.hadoop.hive.metastore.hbase does not exist
[ERROR] /data/hive-ptest/working/apache-github-source-source/itests/util/src/main/java/org/apache/hadoop/hive/ql/QTestUtil.java:[86,46]
package org.apache.hadoop.hive.metastore.hbase does not exist
[ERROR] /data/hive-ptest/working/apache-github-source-source/itests/util/src/main/java/org/apache/hadoop/hive/ql/QTestUtil.java:[358,12]
cannot access org.apache.hadoop.hbase.HBaseCommonTestingUtility
  class file for org.apache.hadoop.hbase.HBaseCommonTestingUtility not found
[ERROR] /data/hive-ptest/working/apache-github-source-source/itests/util/src/main/java/org/apache/hadoop/hive/ql/QTestUtil.java:[362,29]
cannot find symbol
  symbol:   variable HBaseReadWrite
  location: class org.apache.hadoop.hive.ql.QTestUtil
[ERROR] /data/hive-ptest/working/apache-github-source-source/itests/util/src/main/java/org/apache/hadoop/hive/ql/QTestUtil.java:[363,45]
package HBaseReadWrite does not exist
[ERROR] /data/hive-ptest/working/apache-github-source-source/itests/util/src/main/java/org/apache/hadoop/hive/ql/QTestUtil.java:[372,5]
cannot find symbol
  symbol:   variable HBaseReadWrite
  location: class org.apache.hadoop.hive.ql.QTestUtil
[INFO] 6 errors 
[INFO] -------------------------------------------------------------
[INFO] ------------------------------------------------------------------------
[INFO] Reactor Summary:
[INFO] 
[INFO] Hive Integration - Parent ......................... SUCCESS [10.358s]
[INFO] Hive Integration - Custom Serde ................... SUCCESS [18.463s]
[INFO] Hive Integration - HCatalog Unit Tests ............ SUCCESS [14.513s]
[INFO] Hive Integration - Testing Utilities .............. FAILURE [16.067s]
[INFO] Hive Integration - Unit Tests ..................... SKIPPED
[INFO] Hive Integration - Test Serde ..................... SKIPPED
[INFO] Hive Integration - QFile Tests .................... SKIPPED
[INFO] Hive Integration - QFile Accumulo Tests ........... SKIPPED
[INFO] JMH benchmark: Hive ............................... SKIPPED
[INFO] Hive Integration - QFile Spark Tests .............. SKIPPED
[INFO] ------------------------------------------------------------------------
[INFO] BUILD FAILURE
[INFO] ------------------------------------------------------------------------
[INFO] Total time: 1:01.822s
[INFO] Finished at: Thu Sep 03 15:38:20 EDT 2015
[INFO] Final Memory: 67M/160M
[INFO] ------------------------------------------------------------------------
[ERROR] Failed to execute goal org.apache.maven.plugins:maven-compiler-plugin:3.1:compile
(default-compile) on project hive-it-util: Compilation failure: Compilation failure:
[ERROR] /data/hive-ptest/working/apache-github-source-source/itests/util/src/main/java/org/apache/hadoop/hive/ql/QTestUtil.java:[86,46]
package org.apache.hadoop.hive.metastore.hbase does not exist
[ERROR] /data/hive-ptest/working/apache-github-source-source/itests/util/src/main/java/org/apache/hadoop/hive/ql/QTestUtil.java:[86,46]
package org.apache.hadoop.hive.metastore.hbase does not exist
[ERROR] /data/hive-ptest/working/apache-github-source-source/itests/util/src/main/java/org/apache/hadoop/hive/ql/QTestUtil.java:[358,12]
cannot access org.apache.hadoop.hbase.HBaseCommonTestingUtility
[ERROR] class file for org.apache.hadoop.hbase.HBaseCommonTestingUtility not found
[ERROR] /data/hive-ptest/working/apache-github-source-source/itests/util/src/main/java/org/apache/hadoop/hive/ql/QTestUtil.java:[362,29]
cannot find symbol
[ERROR] symbol:   variable HBaseReadWrite
[ERROR] location: class org.apache.hadoop.hive.ql.QTestUtil
[ERROR] /data/hive-ptest/working/apache-github-source-source/itests/util/src/main/java/org/apache/hadoop/hive/ql/QTestUtil.java:[363,45]
package HBaseReadWrite does not exist
[ERROR] /data/hive-ptest/working/apache-github-source-source/itests/util/src/main/java/org/apache/hadoop/hive/ql/QTestUtil.java:[372,5]
cannot find symbol
[ERROR] symbol:   variable HBaseReadWrite
[ERROR] location: class org.apache.hadoop.hive.ql.QTestUtil
[ERROR] -> [Help 1]
[ERROR] 
[ERROR] To see the full stack trace of the errors, re-run Maven with the -e switch.
[ERROR] Re-run Maven using the -X switch to enable full debug logging.
[ERROR] 
[ERROR] For more information about the errors and possible solutions, please read the following
articles:
[ERROR] [Help 1] http://cwiki.apache.org/confluence/display/MAVEN/MojoFailureException
[ERROR] 
[ERROR] After correcting the problems, you can resume the build with the command
[ERROR]   mvn <goals> -rf :hive-it-util
+ exit 1
'
{noformat}

This message is automatically generated.

ATTACHMENT ID: 12754032 - PreCommit-HIVE-TRUNK-Build

> Merge hbase-metastore branch to trunk
> -------------------------------------
>
>                 Key: HIVE-11711
>                 URL: https://issues.apache.org/jira/browse/HIVE-11711
>             Project: Hive
>          Issue Type: Sub-task
>          Components: HBase Metastore
>            Reporter: Daniel Dai
>            Assignee: Daniel Dai
>             Fix For: 2.0.0
>
>         Attachments: HIVE-11711.1.patch, HIVE-11711.2.patch
>
>
> Major development of hbase-metastore is done and it's time to merge the branch back into
master.
> Currently hbase-metastore is only invoked when running TestMiniTezCliDriver. The instruction
for setting up hbase-metastore is captured in https://cwiki.apache.org/confluence/display/Hive/HBaseMetastoreDevelopmentGuide.



--
This message was sent by Atlassian JIRA
(v6.3.4#6332)

Mime
View raw message