hive-issues mailing list archives

Site index · List index
Message view « Date » · « Thread »
Top « Date » · « Thread »
From "Hive QA (JIRA)" <j...@apache.org>
Subject [jira] [Commented] (HIVE-11642) LLAP: make sure tests pass #3
Date Fri, 04 Sep 2015 04:12:47 GMT

    [ https://issues.apache.org/jira/browse/HIVE-11642?page=com.atlassian.jira.plugin.system.issuetabpanels:comment-tabpanel&focusedCommentId=14730284#comment-14730284
] 

Hive QA commented on HIVE-11642:
--------------------------------



{color:red}Overall{color}: -1 no tests executed

Here are the results of testing the latest attachment:
https://issues.apache.org/jira/secure/attachment/12754131/HIVE-11642.04.patch

Test results: http://ec2-174-129-184-35.compute-1.amazonaws.com/jenkins/job/PreCommit-HIVE-TRUNK-Build/5174/testReport
Console output: http://ec2-174-129-184-35.compute-1.amazonaws.com/jenkins/job/PreCommit-HIVE-TRUNK-Build/5174/console
Test logs: http://ec2-174-129-184-35.compute-1.amazonaws.com/logs/PreCommit-HIVE-TRUNK-Build-5174/

Messages:
{noformat}
**** This message was trimmed, see log for full details ****
[INFO] Executing tasks

main:
[INFO] Executed tasks
[INFO] 
[INFO] --- maven-antrun-plugin:1.7:run (setup-test-dirs) @ hive-it ---
[INFO] Executing tasks

main:
    [mkdir] Created dir: /data/hive-ptest/working/apache-github-source-source/itests/target/tmp
    [mkdir] Created dir: /data/hive-ptest/working/apache-github-source-source/itests/target/warehouse
    [mkdir] Created dir: /data/hive-ptest/working/apache-github-source-source/itests/target/tmp/conf
     [copy] Copying 12 files to /data/hive-ptest/working/apache-github-source-source/itests/target/tmp/conf
[INFO] Executed tasks
[INFO] 
[INFO] --- maven-site-plugin:3.3:attach-descriptor (attach-descriptor) @ hive-it ---
[INFO] 
[INFO] --- maven-install-plugin:2.4:install (default-install) @ hive-it ---
[INFO] Installing /data/hive-ptest/working/apache-github-source-source/itests/pom.xml to /home/hiveptest/.m2/repository/org/apache/hive/hive-it/2.0.0-SNAPSHOT/hive-it-2.0.0-SNAPSHOT.pom
[INFO]                                                                         
[INFO] ------------------------------------------------------------------------
[INFO] Building Hive Integration - Custom Serde 2.0.0-SNAPSHOT
[INFO] ------------------------------------------------------------------------
[INFO] 
[INFO] --- maven-clean-plugin:2.5:clean (default-clean) @ hive-it-custom-serde ---
[INFO] Deleting /data/hive-ptest/working/apache-github-source-source/itests/custom-serde/target
[INFO] Deleting /data/hive-ptest/working/apache-github-source-source/itests/custom-serde (includes
= [datanucleus.log, derby.log], excludes = [])
[INFO] 
[INFO] --- maven-enforcer-plugin:1.3.1:enforce (enforce-no-snapshots) @ hive-it-custom-serde
---
[INFO] 
[INFO] --- maven-antrun-plugin:1.7:run (download-spark) @ hive-it-custom-serde ---
[INFO] Executing tasks

main:
[INFO] Executed tasks
[INFO] 
[INFO] --- maven-remote-resources-plugin:1.5:process (default) @ hive-it-custom-serde ---
Downloading: https://s3-us-west-1.amazonaws.com/hive-spark/maven2/spark_2.10-1.3-rc1/org/pentaho/pentaho-aggdesigner/5.1.5-jhyde/pentaho-aggdesigner-5.1.5-jhyde.pom

[WARNING] Invalid project model for artifact [pentaho-aggdesigner-algorithm:org.pentaho:5.1.5-jhyde].
It will be ignored by the remote resources Mojo.
[INFO] 
[INFO] --- maven-resources-plugin:2.6:resources (default-resources) @ hive-it-custom-serde
---
[INFO] Using 'UTF-8' encoding to copy filtered resources.
[INFO] Copying 1 resource
[INFO] Copying 3 resources
[INFO] 
[INFO] --- maven-antrun-plugin:1.7:run (define-classpath) @ hive-it-custom-serde ---
[INFO] Executing tasks

main:
[INFO] Executed tasks
[INFO] 
[INFO] --- maven-compiler-plugin:3.1:compile (default-compile) @ hive-it-custom-serde ---
[INFO] Compiling 10 source files to /data/hive-ptest/working/apache-github-source-source/itests/custom-serde/target/classes
[WARNING] /data/hive-ptest/working/apache-github-source-source/itests/custom-serde/src/main/java/org/apache/hadoop/hive/serde2/CustomSerDe2.java:
Some input files use or override a deprecated API.
[WARNING] /data/hive-ptest/working/apache-github-source-source/itests/custom-serde/src/main/java/org/apache/hadoop/hive/serde2/CustomSerDe2.java:
Recompile with -Xlint:deprecation for details.
[INFO] 
[INFO] --- maven-resources-plugin:2.6:testResources (default-testResources) @ hive-it-custom-serde
---
[INFO] Using 'UTF-8' encoding to copy filtered resources.
[INFO] skip non existing resourceDirectory /data/hive-ptest/working/apache-github-source-source/itests/custom-serde/src/test/resources
[INFO] Copying 3 resources
[INFO] 
[INFO] --- maven-antrun-plugin:1.7:run (setup-test-dirs) @ hive-it-custom-serde ---
[INFO] Executing tasks

main:
    [mkdir] Created dir: /data/hive-ptest/working/apache-github-source-source/itests/custom-serde/target/tmp
    [mkdir] Created dir: /data/hive-ptest/working/apache-github-source-source/itests/custom-serde/target/warehouse
    [mkdir] Created dir: /data/hive-ptest/working/apache-github-source-source/itests/custom-serde/target/tmp/conf
     [copy] Copying 12 files to /data/hive-ptest/working/apache-github-source-source/itests/custom-serde/target/tmp/conf
[INFO] Executed tasks
[INFO] 
[INFO] --- maven-compiler-plugin:3.1:testCompile (default-testCompile) @ hive-it-custom-serde
---
[INFO] No sources to compile
[INFO] 
[INFO] --- maven-surefire-plugin:2.16:test (default-test) @ hive-it-custom-serde ---
[INFO] Tests are skipped.
[INFO] 
[INFO] --- maven-jar-plugin:2.2:jar (default-jar) @ hive-it-custom-serde ---
[INFO] Building jar: /data/hive-ptest/working/apache-github-source-source/itests/custom-serde/target/hive-it-custom-serde-2.0.0-SNAPSHOT.jar
[INFO] 
[INFO] --- maven-site-plugin:3.3:attach-descriptor (attach-descriptor) @ hive-it-custom-serde
---
[INFO] 
[INFO] --- maven-install-plugin:2.4:install (default-install) @ hive-it-custom-serde ---
[INFO] Installing /data/hive-ptest/working/apache-github-source-source/itests/custom-serde/target/hive-it-custom-serde-2.0.0-SNAPSHOT.jar
to /home/hiveptest/.m2/repository/org/apache/hive/hive-it-custom-serde/2.0.0-SNAPSHOT/hive-it-custom-serde-2.0.0-SNAPSHOT.jar
[INFO] Installing /data/hive-ptest/working/apache-github-source-source/itests/custom-serde/pom.xml
to /home/hiveptest/.m2/repository/org/apache/hive/hive-it-custom-serde/2.0.0-SNAPSHOT/hive-it-custom-serde-2.0.0-SNAPSHOT.pom
[INFO]                                                                         
[INFO] ------------------------------------------------------------------------
[INFO] Building Hive Integration - HCatalog Unit Tests 2.0.0-SNAPSHOT
[INFO] ------------------------------------------------------------------------
[INFO] 
[INFO] --- maven-clean-plugin:2.5:clean (default-clean) @ hive-hcatalog-it-unit ---
[INFO] Deleting /data/hive-ptest/working/apache-github-source-source/itests/hcatalog-unit/target
[INFO] Deleting /data/hive-ptest/working/apache-github-source-source/itests/hcatalog-unit
(includes = [datanucleus.log, derby.log], excludes = [])
[INFO] 
[INFO] --- maven-enforcer-plugin:1.3.1:enforce (enforce-no-snapshots) @ hive-hcatalog-it-unit
---
[INFO] 
[INFO] --- maven-antrun-plugin:1.7:run (download-spark) @ hive-hcatalog-it-unit ---
[INFO] Executing tasks

main:
[INFO] Executed tasks
[INFO] 
[INFO] --- maven-remote-resources-plugin:1.5:process (default) @ hive-hcatalog-it-unit ---
[INFO] 
[INFO] --- maven-resources-plugin:2.6:resources (default-resources) @ hive-hcatalog-it-unit
---
[INFO] Using 'UTF-8' encoding to copy filtered resources.
[INFO] skip non existing resourceDirectory /data/hive-ptest/working/apache-github-source-source/itests/hcatalog-unit/src/main/resources
[INFO] Copying 3 resources
[INFO] 
[INFO] --- maven-antrun-plugin:1.7:run (define-classpath) @ hive-hcatalog-it-unit ---
[INFO] Executing tasks

main:
[INFO] Executed tasks
[INFO] 
[INFO] --- maven-compiler-plugin:3.1:compile (default-compile) @ hive-hcatalog-it-unit ---
[INFO] No sources to compile
[INFO] 
[INFO] --- maven-resources-plugin:2.6:testResources (default-testResources) @ hive-hcatalog-it-unit
---
[INFO] Using 'UTF-8' encoding to copy filtered resources.
[INFO] skip non existing resourceDirectory /data/hive-ptest/working/apache-github-source-source/itests/hcatalog-unit/src/test/resources
[INFO] Copying 3 resources
[INFO] 
[INFO] --- maven-antrun-plugin:1.7:run (setup-test-dirs) @ hive-hcatalog-it-unit ---
[INFO] Executing tasks

main:
    [mkdir] Created dir: /data/hive-ptest/working/apache-github-source-source/itests/hcatalog-unit/target/tmp
    [mkdir] Created dir: /data/hive-ptest/working/apache-github-source-source/itests/hcatalog-unit/target/warehouse
    [mkdir] Created dir: /data/hive-ptest/working/apache-github-source-source/itests/hcatalog-unit/target/tmp/conf
     [copy] Copying 12 files to /data/hive-ptest/working/apache-github-source-source/itests/hcatalog-unit/target/tmp/conf
[INFO] Executed tasks
[INFO] 
[INFO] --- maven-compiler-plugin:3.1:testCompile (default-testCompile) @ hive-hcatalog-it-unit
---
[INFO] Compiling 8 source files to /data/hive-ptest/working/apache-github-source-source/itests/hcatalog-unit/target/test-classes
[WARNING] /data/hive-ptest/working/apache-github-source-source/itests/hcatalog-unit/src/test/java/org/apache/hive/hcatalog/api/TestHCatClientNotification.java:
Some input files use or override a deprecated API.
[WARNING] /data/hive-ptest/working/apache-github-source-source/itests/hcatalog-unit/src/test/java/org/apache/hive/hcatalog/api/TestHCatClientNotification.java:
Recompile with -Xlint:deprecation for details.
[INFO] 
[INFO] --- maven-surefire-plugin:2.16:test (default-test) @ hive-hcatalog-it-unit ---
[INFO] Tests are skipped.
[INFO] 
[INFO] --- maven-jar-plugin:2.2:jar (default-jar) @ hive-hcatalog-it-unit ---
[INFO] Building jar: /data/hive-ptest/working/apache-github-source-source/itests/hcatalog-unit/target/hive-hcatalog-it-unit-2.0.0-SNAPSHOT.jar
[INFO] 
[INFO] --- maven-site-plugin:3.3:attach-descriptor (attach-descriptor) @ hive-hcatalog-it-unit
---
[INFO] 
[INFO] --- maven-jar-plugin:2.2:test-jar (default) @ hive-hcatalog-it-unit ---
[INFO] Building jar: /data/hive-ptest/working/apache-github-source-source/itests/hcatalog-unit/target/hive-hcatalog-it-unit-2.0.0-SNAPSHOT-tests.jar
[INFO] 
[INFO] --- maven-install-plugin:2.4:install (default-install) @ hive-hcatalog-it-unit ---
[INFO] Installing /data/hive-ptest/working/apache-github-source-source/itests/hcatalog-unit/target/hive-hcatalog-it-unit-2.0.0-SNAPSHOT.jar
to /home/hiveptest/.m2/repository/org/apache/hive/hive-hcatalog-it-unit/2.0.0-SNAPSHOT/hive-hcatalog-it-unit-2.0.0-SNAPSHOT.jar
[INFO] Installing /data/hive-ptest/working/apache-github-source-source/itests/hcatalog-unit/pom.xml
to /home/hiveptest/.m2/repository/org/apache/hive/hive-hcatalog-it-unit/2.0.0-SNAPSHOT/hive-hcatalog-it-unit-2.0.0-SNAPSHOT.pom
[INFO] Installing /data/hive-ptest/working/apache-github-source-source/itests/hcatalog-unit/target/hive-hcatalog-it-unit-2.0.0-SNAPSHOT-tests.jar
to /home/hiveptest/.m2/repository/org/apache/hive/hive-hcatalog-it-unit/2.0.0-SNAPSHOT/hive-hcatalog-it-unit-2.0.0-SNAPSHOT-tests.jar
[INFO]                                                                         
[INFO] ------------------------------------------------------------------------
[INFO] Building Hive Integration - Testing Utilities 2.0.0-SNAPSHOT
[INFO] ------------------------------------------------------------------------
Downloading: http://repository.apache.org/snapshots/org/apache/hive/hive-llap-server/2.0.0-SNAPSHOT/maven-metadata.xml

Downloading: http://repository.apache.org/snapshots/org/apache/hive/hive-llap-server/2.0.0-SNAPSHOT/hive-llap-server-2.0.0-SNAPSHOT.pom

[WARNING] The POM for org.apache.hive:hive-llap-server:jar:2.0.0-SNAPSHOT is missing, no dependency
information available
[WARNING] The POM for org.apache.hive:hive-llap-server:jar:tests:2.0.0-SNAPSHOT is missing,
no dependency information available
Downloading: http://repository.apache.org/snapshots/org/apache/hive/hive-llap-server/2.0.0-SNAPSHOT/hive-llap-server-2.0.0-SNAPSHOT.jar
Downloading: http://repository.apache.org/snapshots/org/apache/hive/hive-llap-server/2.0.0-SNAPSHOT/hive-llap-server-2.0.0-SNAPSHOT-tests.jar


[INFO] ------------------------------------------------------------------------
[INFO] Reactor Summary:
[INFO] 
[INFO] Hive Integration - Parent ......................... SUCCESS [8.803s]
[INFO] Hive Integration - Custom Serde ................... SUCCESS [20.001s]
[INFO] Hive Integration - HCatalog Unit Tests ............ SUCCESS [14.667s]
[INFO] Hive Integration - Testing Utilities .............. FAILURE [2.571s]
[INFO] Hive Integration - Unit Tests ..................... SKIPPED
[INFO] Hive Integration - Test Serde ..................... SKIPPED
[INFO] Hive Integration - QFile Tests .................... SKIPPED
[INFO] Hive Integration - QFile Accumulo Tests ........... SKIPPED
[INFO] JMH benchmark: Hive ............................... SKIPPED
[INFO] Hive Integration - QFile Spark Tests .............. SKIPPED
[INFO] ------------------------------------------------------------------------
[INFO] BUILD FAILURE
[INFO] ------------------------------------------------------------------------
[INFO] Total time: 48.543s
[INFO] Finished at: Fri Sep 04 00:12:28 EDT 2015
[INFO] Final Memory: 47M/141M
[INFO] ------------------------------------------------------------------------
[ERROR] Failed to execute goal on project hive-it-util: Could not resolve dependencies for
project org.apache.hive:hive-it-util:jar:2.0.0-SNAPSHOT: The following artifacts could not
be resolved: org.apache.hive:hive-llap-server:jar:2.0.0-SNAPSHOT, org.apache.hive:hive-llap-server:jar:tests:2.0.0-SNAPSHOT:
Could not find artifact org.apache.hive:hive-llap-server:jar:2.0.0-SNAPSHOT in apache.snapshots
(http://repository.apache.org/snapshots) -> [Help 1]
[ERROR] 
[ERROR] To see the full stack trace of the errors, re-run Maven with the -e switch.
[ERROR] Re-run Maven using the -X switch to enable full debug logging.
[ERROR] 
[ERROR] For more information about the errors and possible solutions, please read the following
articles:
[ERROR] [Help 1] http://cwiki.apache.org/confluence/display/MAVEN/DependencyResolutionException
[ERROR] 
[ERROR] After correcting the problems, you can resume the build with the command
[ERROR]   mvn <goals> -rf :hive-it-util
+ exit 1
'
{noformat}

This message is automatically generated.

ATTACHMENT ID: 12754131 - PreCommit-HIVE-TRUNK-Build

> LLAP: make sure tests pass #3
> -----------------------------
>
>                 Key: HIVE-11642
>                 URL: https://issues.apache.org/jira/browse/HIVE-11642
>             Project: Hive
>          Issue Type: Sub-task
>            Reporter: Sergey Shelukhin
>            Assignee: Sergey Shelukhin
>         Attachments: HIVE-11642.01.patch, HIVE-11642.02.patch, HIVE-11642.03.patch, HIVE-11642.04.patch,
HIVE-11642.patch
>
>
> Tests should pass against the most recent branch and Tez 0.8.



--
This message was sent by Atlassian JIRA
(v6.3.4#6332)

Mime
View raw message