hive-issues mailing list archives

Site index · List index
Message view « Date » · « Thread »
Top « Date » · « Thread »
From "Hive QA (JIRA)" <j...@apache.org>
Subject [jira] [Commented] (HIVE-11473) Upgrade Spark dependency to 1.5 [Spark Branch]
Date Fri, 25 Sep 2015 07:25:04 GMT

    [ https://issues.apache.org/jira/browse/HIVE-11473?page=com.atlassian.jira.plugin.system.issuetabpanels:comment-tabpanel&focusedCommentId=14907741#comment-14907741
] 

Hive QA commented on HIVE-11473:
--------------------------------



{color:red}Overall{color}: -1 no tests executed

Here are the results of testing the latest attachment:
https://issues.apache.org/jira/secure/attachment/12762295/HIVE-11473.1-spark.patch

Test results: http://ec2-174-129-184-35.compute-1.amazonaws.com/jenkins/job/PreCommit-HIVE-SPARK-Build/950/testReport
Console output: http://ec2-174-129-184-35.compute-1.amazonaws.com/jenkins/job/PreCommit-HIVE-SPARK-Build/950/console
Test logs: http://ec2-50-18-27-0.us-west-1.compute.amazonaws.com/logs/PreCommit-HIVE-SPARK-Build-950/

Messages:
{noformat}
**** This message was trimmed, see log for full details ****
[INFO] ------------------------------------------------------------------------
Downloading: http://www.datanucleus.org/downloads/maven2/org/apache/spark/spark-core_2.10/1.5.0/spark-core_2.10-1.5.0.pom
Downloading: https://s3-us-west-1.amazonaws.com/hive-spark/maven2/spark_2.10-1.3-rc1/org/apache/spark/spark-core_2.10/1.5.0/spark-core_2.10-1.5.0.pom
Downloading: http://repo.maven.apache.org/maven2/org/apache/spark/spark-core_2.10/1.5.0/spark-core_2.10-1.5.0.pom
Downloaded: http://repo.maven.apache.org/maven2/org/apache/spark/spark-core_2.10/1.5.0/spark-core_2.10-1.5.0.pom
(20 KB at 189.7 KB/sec)
Downloading: http://www.datanucleus.org/downloads/maven2/org/apache/spark/spark-parent_2.10/1.5.0/spark-parent_2.10-1.5.0.pom
Downloading: https://s3-us-west-1.amazonaws.com/hive-spark/maven2/spark_2.10-1.3-rc1/org/apache/spark/spark-parent_2.10/1.5.0/spark-parent_2.10-1.5.0.pom
Downloading: http://repo.maven.apache.org/maven2/org/apache/spark/spark-parent_2.10/1.5.0/spark-parent_2.10-1.5.0.pom
Downloaded: http://repo.maven.apache.org/maven2/org/apache/spark/spark-parent_2.10/1.5.0/spark-parent_2.10-1.5.0.pom
(85 KB at 1153.1 KB/sec)
Downloading: http://www.datanucleus.org/downloads/maven2/org/apache/spark/spark-launcher_2.10/1.5.0/spark-launcher_2.10-1.5.0.pom
Downloading: https://s3-us-west-1.amazonaws.com/hive-spark/maven2/spark_2.10-1.3-rc1/org/apache/spark/spark-launcher_2.10/1.5.0/spark-launcher_2.10-1.5.0.pom
Downloading: http://repo.maven.apache.org/maven2/org/apache/spark/spark-launcher_2.10/1.5.0/spark-launcher_2.10-1.5.0.pom
Downloaded: http://repo.maven.apache.org/maven2/org/apache/spark/spark-launcher_2.10/1.5.0/spark-launcher_2.10-1.5.0.pom
(5 KB at 191.7 KB/sec)
Downloading: http://www.datanucleus.org/downloads/maven2/org/apache/spark/spark-network-common_2.10/1.5.0/spark-network-common_2.10-1.5.0.pom
Downloading: https://s3-us-west-1.amazonaws.com/hive-spark/maven2/spark_2.10-1.3-rc1/org/apache/spark/spark-network-common_2.10/1.5.0/spark-network-common_2.10-1.5.0.pom
Downloading: http://repo.maven.apache.org/maven2/org/apache/spark/spark-network-common_2.10/1.5.0/spark-network-common_2.10-1.5.0.pom
Downloaded: http://repo.maven.apache.org/maven2/org/apache/spark/spark-network-common_2.10/1.5.0/spark-network-common_2.10-1.5.0.pom
(4 KB at 136.1 KB/sec)
Downloading: http://www.datanucleus.org/downloads/maven2/org/apache/spark/spark-network-shuffle_2.10/1.5.0/spark-network-shuffle_2.10-1.5.0.pom
Downloading: https://s3-us-west-1.amazonaws.com/hive-spark/maven2/spark_2.10-1.3-rc1/org/apache/spark/spark-network-shuffle_2.10/1.5.0/spark-network-shuffle_2.10-1.5.0.pom
Downloading: http://repo.maven.apache.org/maven2/org/apache/spark/spark-network-shuffle_2.10/1.5.0/spark-network-shuffle_2.10-1.5.0.pom
Downloaded: http://repo.maven.apache.org/maven2/org/apache/spark/spark-network-shuffle_2.10/1.5.0/spark-network-shuffle_2.10-1.5.0.pom
(4 KB at 142.4 KB/sec)
Downloading: http://www.datanucleus.org/downloads/maven2/org/apache/spark/spark-unsafe_2.10/1.5.0/spark-unsafe_2.10-1.5.0.pom
Downloading: https://s3-us-west-1.amazonaws.com/hive-spark/maven2/spark_2.10-1.3-rc1/org/apache/spark/spark-unsafe_2.10/1.5.0/spark-unsafe_2.10-1.5.0.pom
Downloading: http://repo.maven.apache.org/maven2/org/apache/spark/spark-unsafe_2.10/1.5.0/spark-unsafe_2.10-1.5.0.pom
Downloading: https://repository.apache.org/content/repositories/releases/org/apache/spark/spark-unsafe_2.10/1.5.0/spark-unsafe_2.10-1.5.0.pom
Downloaded: https://repository.apache.org/content/repositories/releases/org/apache/spark/spark-unsafe_2.10/1.5.0/spark-unsafe_2.10-1.5.0.pom
(5 KB at 4.1 KB/sec)
Downloading: http://www.datanucleus.org/downloads/maven2/net/jpountz/lz4/lz4/1.3.0/lz4-1.3.0.pom
Downloading: https://s3-us-west-1.amazonaws.com/hive-spark/maven2/spark_2.10-1.3-rc1/net/jpountz/lz4/lz4/1.3.0/lz4-1.3.0.pom
Downloading: http://repo.maven.apache.org/maven2/net/jpountz/lz4/lz4/1.3.0/lz4-1.3.0.pom
Downloaded: http://repo.maven.apache.org/maven2/net/jpountz/lz4/lz4/1.3.0/lz4-1.3.0.pom (2
KB at 52.3 KB/sec)
Downloading: http://www.datanucleus.org/downloads/maven2/com/typesafe/akka/akka-remote_2.10/2.3.11/akka-remote_2.10-2.3.11.pom
Downloading: https://s3-us-west-1.amazonaws.com/hive-spark/maven2/spark_2.10-1.3-rc1/com/typesafe/akka/akka-remote_2.10/2.3.11/akka-remote_2.10-2.3.11.pom
Downloading: http://repo.maven.apache.org/maven2/com/typesafe/akka/akka-remote_2.10/2.3.11/akka-remote_2.10-2.3.11.pom
Downloaded: http://repo.maven.apache.org/maven2/com/typesafe/akka/akka-remote_2.10/2.3.11/akka-remote_2.10-2.3.11.pom
(4 KB at 133.1 KB/sec)
Downloading: http://www.datanucleus.org/downloads/maven2/com/typesafe/akka/akka-actor_2.10/2.3.11/akka-actor_2.10-2.3.11.pom
Downloading: https://s3-us-west-1.amazonaws.com/hive-spark/maven2/spark_2.10-1.3-rc1/com/typesafe/akka/akka-actor_2.10/2.3.11/akka-actor_2.10-2.3.11.pom
Downloading: http://repo.maven.apache.org/maven2/com/typesafe/akka/akka-actor_2.10/2.3.11/akka-actor_2.10-2.3.11.pom
Downloaded: http://repo.maven.apache.org/maven2/com/typesafe/akka/akka-actor_2.10/2.3.11/akka-actor_2.10-2.3.11.pom
(2 KB at 72.3 KB/sec)
Downloading: http://www.datanucleus.org/downloads/maven2/com/typesafe/akka/akka-slf4j_2.10/2.3.11/akka-slf4j_2.10-2.3.11.pom
Downloading: https://s3-us-west-1.amazonaws.com/hive-spark/maven2/spark_2.10-1.3-rc1/com/typesafe/akka/akka-slf4j_2.10/2.3.11/akka-slf4j_2.10-2.3.11.pom
Downloading: http://repo.maven.apache.org/maven2/com/typesafe/akka/akka-slf4j_2.10/2.3.11/akka-slf4j_2.10-2.3.11.pom
Downloaded: http://repo.maven.apache.org/maven2/com/typesafe/akka/akka-slf4j_2.10/2.3.11/akka-slf4j_2.10-2.3.11.pom
(3 KB at 95.3 KB/sec)
Downloading: http://www.datanucleus.org/downloads/maven2/io/dropwizard/metrics/metrics-core/3.1.2/metrics-core-3.1.2.pom
Downloading: https://s3-us-west-1.amazonaws.com/hive-spark/maven2/spark_2.10-1.3-rc1/io/dropwizard/metrics/metrics-core/3.1.2/metrics-core-3.1.2.pom
Downloading: http://repo.maven.apache.org/maven2/io/dropwizard/metrics/metrics-core/3.1.2/metrics-core-3.1.2.pom
Downloaded: http://repo.maven.apache.org/maven2/io/dropwizard/metrics/metrics-core/3.1.2/metrics-core-3.1.2.pom
(846 B at 31.8 KB/sec)
Downloading: http://www.datanucleus.org/downloads/maven2/io/dropwizard/metrics/metrics-parent/3.1.2/metrics-parent-3.1.2.pom
Downloading: https://s3-us-west-1.amazonaws.com/hive-spark/maven2/spark_2.10-1.3-rc1/io/dropwizard/metrics/metrics-parent/3.1.2/metrics-parent-3.1.2.pom
Downloading: http://repo.maven.apache.org/maven2/io/dropwizard/metrics/metrics-parent/3.1.2/metrics-parent-3.1.2.pom
Downloaded: http://repo.maven.apache.org/maven2/io/dropwizard/metrics/metrics-parent/3.1.2/metrics-parent-3.1.2.pom
(12 KB at 434.1 KB/sec)
Downloading: http://www.datanucleus.org/downloads/maven2/io/dropwizard/metrics/metrics-jvm/3.1.2/metrics-jvm-3.1.2.pom
Downloading: https://s3-us-west-1.amazonaws.com/hive-spark/maven2/spark_2.10-1.3-rc1/io/dropwizard/metrics/metrics-jvm/3.1.2/metrics-jvm-3.1.2.pom
Downloading: http://repo.maven.apache.org/maven2/io/dropwizard/metrics/metrics-jvm/3.1.2/metrics-jvm-3.1.2.pom
Downloaded: http://repo.maven.apache.org/maven2/io/dropwizard/metrics/metrics-jvm/3.1.2/metrics-jvm-3.1.2.pom
(967 B at 36.3 KB/sec)
Downloading: http://www.datanucleus.org/downloads/maven2/io/dropwizard/metrics/metrics-json/3.1.2/metrics-json-3.1.2.pom
Downloading: https://s3-us-west-1.amazonaws.com/hive-spark/maven2/spark_2.10-1.3-rc1/io/dropwizard/metrics/metrics-json/3.1.2/metrics-json-3.1.2.pom
Downloading: http://repo.maven.apache.org/maven2/io/dropwizard/metrics/metrics-json/3.1.2/metrics-json-3.1.2.pom
Downloaded: http://repo.maven.apache.org/maven2/io/dropwizard/metrics/metrics-json/3.1.2/metrics-json-3.1.2.pom
(2 KB at 51.9 KB/sec)
Downloading: http://www.datanucleus.org/downloads/maven2/io/dropwizard/metrics/metrics-graphite/3.1.2/metrics-graphite-3.1.2.pom
Downloading: https://s3-us-west-1.amazonaws.com/hive-spark/maven2/spark_2.10-1.3-rc1/io/dropwizard/metrics/metrics-graphite/3.1.2/metrics-graphite-3.1.2.pom
Downloading: http://repo.maven.apache.org/maven2/io/dropwizard/metrics/metrics-graphite/3.1.2/metrics-graphite-3.1.2.pom
Downloaded: http://repo.maven.apache.org/maven2/io/dropwizard/metrics/metrics-graphite/3.1.2/metrics-graphite-3.1.2.pom
(2 KB at 36.2 KB/sec)
Downloading: http://www.datanucleus.org/downloads/maven2/org/tachyonproject/tachyon-client/0.7.1/tachyon-client-0.7.1.pom
Downloading: https://s3-us-west-1.amazonaws.com/hive-spark/maven2/spark_2.10-1.3-rc1/org/tachyonproject/tachyon-client/0.7.1/tachyon-client-0.7.1.pom
Downloading: http://repo.maven.apache.org/maven2/org/tachyonproject/tachyon-client/0.7.1/tachyon-client-0.7.1.pom
Downloaded: http://repo.maven.apache.org/maven2/org/tachyonproject/tachyon-client/0.7.1/tachyon-client-0.7.1.pom
(8 KB at 267.2 KB/sec)
Downloading: http://www.datanucleus.org/downloads/maven2/org/tachyonproject/tachyon-clients/0.7.1/tachyon-clients-0.7.1.pom
Downloading: https://s3-us-west-1.amazonaws.com/hive-spark/maven2/spark_2.10-1.3-rc1/org/tachyonproject/tachyon-clients/0.7.1/tachyon-clients-0.7.1.pom
Downloading: http://repo.maven.apache.org/maven2/org/tachyonproject/tachyon-clients/0.7.1/tachyon-clients-0.7.1.pom
Downloaded: http://repo.maven.apache.org/maven2/org/tachyonproject/tachyon-clients/0.7.1/tachyon-clients-0.7.1.pom
(918 B at 34.5 KB/sec)
Downloading: http://www.datanucleus.org/downloads/maven2/org/tachyonproject/tachyon-parent/0.7.1/tachyon-parent-0.7.1.pom
Downloading: https://s3-us-west-1.amazonaws.com/hive-spark/maven2/spark_2.10-1.3-rc1/org/tachyonproject/tachyon-parent/0.7.1/tachyon-parent-0.7.1.pom
Downloading: http://repo.maven.apache.org/maven2/org/tachyonproject/tachyon-parent/0.7.1/tachyon-parent-0.7.1.pom
Downloaded: http://repo.maven.apache.org/maven2/org/tachyonproject/tachyon-parent/0.7.1/tachyon-parent-0.7.1.pom
(17 KB at 461.3 KB/sec)
Downloading: http://www.datanucleus.org/downloads/maven2/org/tachyonproject/tachyon-underfs-hdfs/0.7.1/tachyon-underfs-hdfs-0.7.1.pom
Downloading: https://s3-us-west-1.amazonaws.com/hive-spark/maven2/spark_2.10-1.3-rc1/org/tachyonproject/tachyon-underfs-hdfs/0.7.1/tachyon-underfs-hdfs-0.7.1.pom
Downloading: http://repo.maven.apache.org/maven2/org/tachyonproject/tachyon-underfs-hdfs/0.7.1/tachyon-underfs-hdfs-0.7.1.pom
Downloaded: http://repo.maven.apache.org/maven2/org/tachyonproject/tachyon-underfs-hdfs/0.7.1/tachyon-underfs-hdfs-0.7.1.pom
(2 KB at 63.6 KB/sec)
Downloading: http://www.datanucleus.org/downloads/maven2/org/tachyonproject/tachyon-underfs/0.7.1/tachyon-underfs-0.7.1.pom
Downloading: https://s3-us-west-1.amazonaws.com/hive-spark/maven2/spark_2.10-1.3-rc1/org/tachyonproject/tachyon-underfs/0.7.1/tachyon-underfs-0.7.1.pom
Downloading: http://repo.maven.apache.org/maven2/org/tachyonproject/tachyon-underfs/0.7.1/tachyon-underfs-0.7.1.pom
Downloaded: http://repo.maven.apache.org/maven2/org/tachyonproject/tachyon-underfs/0.7.1/tachyon-underfs-0.7.1.pom
(2 KB at 39.2 KB/sec)
Downloading: http://www.datanucleus.org/downloads/maven2/org/tachyonproject/tachyon-underfs-local/0.7.1/tachyon-underfs-local-0.7.1.pom
Downloading: https://s3-us-west-1.amazonaws.com/hive-spark/maven2/spark_2.10-1.3-rc1/org/tachyonproject/tachyon-underfs-local/0.7.1/tachyon-underfs-local-0.7.1.pom
Downloading: http://repo.maven.apache.org/maven2/org/tachyonproject/tachyon-underfs-local/0.7.1/tachyon-underfs-local-0.7.1.pom
Downloaded: http://repo.maven.apache.org/maven2/org/tachyonproject/tachyon-underfs-local/0.7.1/tachyon-underfs-local-0.7.1.pom
(2 KB at 66.7 KB/sec)
Downloading: http://www.datanucleus.org/downloads/maven2/org/apache/spark/spark-core_2.10/1.5.0/spark-core_2.10-1.5.0.jar
Downloading: http://www.datanucleus.org/downloads/maven2/org/apache/spark/spark-launcher_2.10/1.5.0/spark-launcher_2.10-1.5.0.jar
Downloading: http://www.datanucleus.org/downloads/maven2/org/apache/spark/spark-network-common_2.10/1.5.0/spark-network-common_2.10-1.5.0.jar
Downloading: http://www.datanucleus.org/downloads/maven2/org/apache/spark/spark-network-shuffle_2.10/1.5.0/spark-network-shuffle_2.10-1.5.0.jar
Downloading: http://www.datanucleus.org/downloads/maven2/org/apache/spark/spark-unsafe_2.10/1.5.0/spark-unsafe_2.10-1.5.0.jar
Downloading: http://www.datanucleus.org/downloads/maven2/net/jpountz/lz4/lz4/1.3.0/lz4-1.3.0.jar
Downloading: http://www.datanucleus.org/downloads/maven2/com/typesafe/akka/akka-remote_2.10/2.3.11/akka-remote_2.10-2.3.11.jar
Downloading: http://www.datanucleus.org/downloads/maven2/com/typesafe/akka/akka-slf4j_2.10/2.3.11/akka-slf4j_2.10-2.3.11.jar
Downloading: http://www.datanucleus.org/downloads/maven2/com/typesafe/akka/akka-actor_2.10/2.3.11/akka-actor_2.10-2.3.11.jar
Downloading: http://www.datanucleus.org/downloads/maven2/io/dropwizard/metrics/metrics-graphite/3.1.2/metrics-graphite-3.1.2.jar
Downloading: http://www.datanucleus.org/downloads/maven2/org/tachyonproject/tachyon-client/0.7.1/tachyon-client-0.7.1.jar
Downloading: http://www.datanucleus.org/downloads/maven2/org/tachyonproject/tachyon-underfs-hdfs/0.7.1/tachyon-underfs-hdfs-0.7.1.jar
Downloading: http://www.datanucleus.org/downloads/maven2/org/tachyonproject/tachyon-underfs-local/0.7.1/tachyon-underfs-local-0.7.1.jar
Downloading: https://s3-us-west-1.amazonaws.com/hive-spark/maven2/spark_2.10-1.3-rc1/org/apache/spark/spark-core_2.10/1.5.0/spark-core_2.10-1.5.0.jar
Downloading: https://s3-us-west-1.amazonaws.com/hive-spark/maven2/spark_2.10-1.3-rc1/org/apache/spark/spark-network-common_2.10/1.5.0/spark-network-common_2.10-1.5.0.jar
Downloading: https://s3-us-west-1.amazonaws.com/hive-spark/maven2/spark_2.10-1.3-rc1/org/apache/spark/spark-launcher_2.10/1.5.0/spark-launcher_2.10-1.5.0.jar
Downloading: https://s3-us-west-1.amazonaws.com/hive-spark/maven2/spark_2.10-1.3-rc1/org/apache/spark/spark-unsafe_2.10/1.5.0/spark-unsafe_2.10-1.5.0.jar
Downloading: https://s3-us-west-1.amazonaws.com/hive-spark/maven2/spark_2.10-1.3-rc1/org/apache/spark/spark-network-shuffle_2.10/1.5.0/spark-network-shuffle_2.10-1.5.0.jar
Downloading: https://s3-us-west-1.amazonaws.com/hive-spark/maven2/spark_2.10-1.3-rc1/net/jpountz/lz4/lz4/1.3.0/lz4-1.3.0.jar
Downloading: https://s3-us-west-1.amazonaws.com/hive-spark/maven2/spark_2.10-1.3-rc1/com/typesafe/akka/akka-remote_2.10/2.3.11/akka-remote_2.10-2.3.11.jar
Downloading: https://s3-us-west-1.amazonaws.com/hive-spark/maven2/spark_2.10-1.3-rc1/com/typesafe/akka/akka-actor_2.10/2.3.11/akka-actor_2.10-2.3.11.jar
Downloading: https://s3-us-west-1.amazonaws.com/hive-spark/maven2/spark_2.10-1.3-rc1/com/typesafe/akka/akka-slf4j_2.10/2.3.11/akka-slf4j_2.10-2.3.11.jar
Downloading: https://s3-us-west-1.amazonaws.com/hive-spark/maven2/spark_2.10-1.3-rc1/io/dropwizard/metrics/metrics-graphite/3.1.2/metrics-graphite-3.1.2.jar
Downloading: https://s3-us-west-1.amazonaws.com/hive-spark/maven2/spark_2.10-1.3-rc1/org/tachyonproject/tachyon-client/0.7.1/tachyon-client-0.7.1.jar
Downloading: https://s3-us-west-1.amazonaws.com/hive-spark/maven2/spark_2.10-1.3-rc1/org/tachyonproject/tachyon-underfs-hdfs/0.7.1/tachyon-underfs-hdfs-0.7.1.jar
Downloading: https://s3-us-west-1.amazonaws.com/hive-spark/maven2/spark_2.10-1.3-rc1/org/tachyonproject/tachyon-underfs-local/0.7.1/tachyon-underfs-local-0.7.1.jar
Downloading: http://repo.maven.apache.org/maven2/org/apache/spark/spark-core_2.10/1.5.0/spark-core_2.10-1.5.0.jar
Downloading: http://repo.maven.apache.org/maven2/org/apache/spark/spark-launcher_2.10/1.5.0/spark-launcher_2.10-1.5.0.jar
Downloading: http://repo.maven.apache.org/maven2/org/apache/spark/spark-network-common_2.10/1.5.0/spark-network-common_2.10-1.5.0.jar
Downloading: http://repo.maven.apache.org/maven2/org/apache/spark/spark-network-shuffle_2.10/1.5.0/spark-network-shuffle_2.10-1.5.0.jar
Downloading: http://repo.maven.apache.org/maven2/org/apache/spark/spark-unsafe_2.10/1.5.0/spark-unsafe_2.10-1.5.0.jar
Downloaded: http://repo.maven.apache.org/maven2/org/apache/spark/spark-network-shuffle_2.10/1.5.0/spark-network-shuffle_2.10-1.5.0.jar
(49 KB at 859.1 KB/sec)
Downloading: http://repo.maven.apache.org/maven2/net/jpountz/lz4/lz4/1.3.0/lz4-1.3.0.jar
Downloaded: http://repo.maven.apache.org/maven2/org/apache/spark/spark-launcher_2.10/1.5.0/spark-launcher_2.10-1.5.0.jar
(43 KB at 611.4 KB/sec)
Downloading: http://repo.maven.apache.org/maven2/com/typesafe/akka/akka-remote_2.10/2.3.11/akka-remote_2.10-2.3.11.jar
Downloaded: http://repo.maven.apache.org/maven2/org/apache/spark/spark-unsafe_2.10/1.5.0/spark-unsafe_2.10-1.5.0.jar
(43 KB at 496.3 KB/sec)
Downloading: http://repo.maven.apache.org/maven2/com/typesafe/akka/akka-actor_2.10/2.3.11/akka-actor_2.10-2.3.11.jar
Downloaded: http://repo.maven.apache.org/maven2/net/jpountz/lz4/lz4/1.3.0/lz4-1.3.0.jar (232
KB at 3401.9 KB/sec)
Downloading: http://repo.maven.apache.org/maven2/com/typesafe/akka/akka-slf4j_2.10/2.3.11/akka-slf4j_2.10-2.3.11.jar
Downloaded: http://repo.maven.apache.org/maven2/com/typesafe/akka/akka-slf4j_2.10/2.3.11/akka-slf4j_2.10-2.3.11.jar
(16 KB at 606.4 KB/sec)
Downloading: http://repo.maven.apache.org/maven2/io/dropwizard/metrics/metrics-graphite/3.1.2/metrics-graphite-3.1.2.jar
Downloaded: http://repo.maven.apache.org/maven2/io/dropwizard/metrics/metrics-graphite/3.1.2/metrics-graphite-3.1.2.jar
(21 KB at 783.2 KB/sec)
Downloading: http://repo.maven.apache.org/maven2/org/tachyonproject/tachyon-client/0.7.1/tachyon-client-0.7.1.jar
Downloaded: http://repo.maven.apache.org/maven2/com/typesafe/akka/akka-remote_2.10/2.3.11/akka-remote_2.10-2.3.11.jar
(1321 KB at 8304.6 KB/sec)
Downloading: http://repo.maven.apache.org/maven2/org/tachyonproject/tachyon-underfs-hdfs/0.7.1/tachyon-underfs-hdfs-0.7.1.jar
Downloaded: http://repo.maven.apache.org/maven2/org/apache/spark/spark-network-common_2.10/1.5.0/spark-network-common_2.10-1.5.0.jar
(2276 KB at 9065.4 KB/sec)
Downloading: http://repo.maven.apache.org/maven2/org/tachyonproject/tachyon-underfs-local/0.7.1/tachyon-underfs-local-0.7.1.jar
Downloaded: http://repo.maven.apache.org/maven2/org/tachyonproject/tachyon-underfs-hdfs/0.7.1/tachyon-underfs-hdfs-0.7.1.jar
(12 KB at 427.8 KB/sec)
Downloaded: http://repo.maven.apache.org/maven2/org/tachyonproject/tachyon-underfs-local/0.7.1/tachyon-underfs-local-0.7.1.jar
(8 KB at 223.3 KB/sec)
Downloaded: http://repo.maven.apache.org/maven2/org/tachyonproject/tachyon-client/0.7.1/tachyon-client-0.7.1.jar
(1926 KB at 15164.2 KB/sec)
Downloaded: http://repo.maven.apache.org/maven2/com/typesafe/akka/akka-actor_2.10/2.3.11/akka-actor_2.10-2.3.11.jar
(2596 KB at 11640.6 KB/sec)
Downloaded: http://repo.maven.apache.org/maven2/org/apache/spark/spark-core_2.10/1.5.0/spark-core_2.10-1.5.0.jar
(10822 KB at 31186.8 KB/sec)
[INFO] 
[INFO] --- maven-clean-plugin:2.5:clean (default-clean) @ spark-client ---
[INFO] Deleting /data/hive-ptest/working/apache-git-source-source/spark-client/target
[INFO] Deleting /data/hive-ptest/working/apache-git-source-source/spark-client (includes =
[datanucleus.log, derby.log], excludes = [])
[INFO] 
[INFO] --- maven-enforcer-plugin:1.3.1:enforce (enforce-no-snapshots) @ spark-client ---
[INFO] 
[INFO] --- maven-remote-resources-plugin:1.5:process (default) @ spark-client ---
[INFO] ------------------------------------------------------------------------
[INFO] Reactor Summary:
[INFO] 
[INFO] Hive .............................................. SUCCESS [3.818s]
[INFO] Hive Shims Common ................................. SUCCESS [4.453s]
[INFO] Hive Shims 0.20S .................................. SUCCESS [1.055s]
[INFO] Hive Shims 0.23 ................................... SUCCESS [3.130s]
[INFO] Hive Shims Scheduler .............................. SUCCESS [0.990s]
[INFO] Hive Shims ........................................ SUCCESS [0.689s]
[INFO] Hive Storage API .................................. SUCCESS [0.790s]
[INFO] Hive Common ....................................... SUCCESS [6.993s]
[INFO] Hive Serde ........................................ SUCCESS [5.060s]
[INFO] Hive Metastore .................................... SUCCESS [14.117s]
[INFO] Hive Ant Utilities ................................ SUCCESS [0.621s]
[INFO] Spark Remote Client ............................... FAILURE [15.362s]
[INFO] Hive Query Language ............................... SKIPPED
[INFO] Hive Service ...................................... SKIPPED
[INFO] Hive Accumulo Handler ............................. SKIPPED
[INFO] Hive JDBC ......................................... SKIPPED
[INFO] Hive Beeline ...................................... SKIPPED
[INFO] Hive CLI .......................................... SKIPPED
[INFO] Hive Contrib ...................................... SKIPPED
[INFO] Hive HBase Handler ................................ SKIPPED
[INFO] Hive HCatalog ..................................... SKIPPED
[INFO] Hive HCatalog Core ................................ SKIPPED
[INFO] Hive HCatalog Pig Adapter ......................... SKIPPED
[INFO] Hive HCatalog Server Extensions ................... SKIPPED
[INFO] Hive HCatalog Webhcat Java Client ................. SKIPPED
[INFO] Hive HCatalog Webhcat ............................. SKIPPED
[INFO] Hive HCatalog Streaming ........................... SKIPPED
[INFO] Hive HPL/SQL ...................................... SKIPPED
[INFO] Hive HWI .......................................... SKIPPED
[INFO] Hive ODBC ......................................... SKIPPED
[INFO] Hive Shims Aggregator ............................. SKIPPED
[INFO] Hive TestUtils .................................... SKIPPED
[INFO] Hive Packaging .................................... SKIPPED
[INFO] ------------------------------------------------------------------------
[INFO] BUILD FAILURE
[INFO] ------------------------------------------------------------------------
[INFO] Total time: 58.124s
[INFO] Finished at: Fri Sep 25 03:38:17 EDT 2015
[INFO] Final Memory: 78M/927M
[INFO] ------------------------------------------------------------------------
[ERROR] Failed to execute goal org.apache.maven.plugins:maven-remote-resources-plugin:1.5:process
(default) on project spark-client: Error resolving project artifact: Failure to transfer org.apache.spark:spark-unsafe_2.10:pom:1.5.0
from https://s3-us-west-1.amazonaws.com/hive-spark/maven2/spark_2.10-1.3-rc1/ was cached in
the local repository, resolution will not be reattempted until the update interval of spark-1.3
has elapsed or updates are forced. Original error: Could not transfer artifact org.apache.spark:spark-unsafe_2.10:pom:1.5.0
from/to spark-1.3 (https://s3-us-west-1.amazonaws.com/hive-spark/maven2/spark_2.10-1.3-rc1/):
Access denied to: https://s3-us-west-1.amazonaws.com/hive-spark/maven2/spark_2.10-1.3-rc1/org/apache/spark/spark-unsafe_2.10/1.5.0/spark-unsafe_2.10-1.5.0.pom
, ReasonPhrase:Forbidden. for project org.apache.spark:spark-unsafe_2.10:jar:1.5.0 -> [Help
1]
[ERROR] 
[ERROR] To see the full stack trace of the errors, re-run Maven with the -e switch.
[ERROR] Re-run Maven using the -X switch to enable full debug logging.
[ERROR] 
[ERROR] For more information about the errors and possible solutions, please read the following
articles:
[ERROR] [Help 1] http://cwiki.apache.org/confluence/display/MAVEN/MojoExecutionException
[ERROR] 
[ERROR] After correcting the problems, you can resume the build with the command
[ERROR]   mvn <goals> -rf :spark-client
'
{noformat}

This message is automatically generated.

ATTACHMENT ID: 12762295 - PreCommit-HIVE-SPARK-Build

> Upgrade Spark dependency to 1.5 [Spark Branch]
> ----------------------------------------------
>
>                 Key: HIVE-11473
>                 URL: https://issues.apache.org/jira/browse/HIVE-11473
>             Project: Hive
>          Issue Type: Bug
>          Components: Spark
>            Reporter: Jimmy Xiang
>            Assignee: Rui Li
>         Attachments: HIVE-11473.1-spark.patch
>
>
> In Spark 1.5, SparkListener interface is changed. So HoS may fail to create the spark
client if the un-implemented event callback method is invoked.



--
This message was sent by Atlassian JIRA
(v6.3.4#6332)

Mime
View raw message