hive-issues mailing list archives

Site index · List index
Message view « Date » · « Thread »
Top « Date » · « Thread »
From "Hive QA (JIRA)" <j...@apache.org>
Subject [jira] [Commented] (HIVE-11383) Upgrade Hive to Calcite 1.4
Date Thu, 30 Jul 2015 11:07:04 GMT

    [ https://issues.apache.org/jira/browse/HIVE-11383?page=com.atlassian.jira.plugin.system.issuetabpanels:comment-tabpanel&focusedCommentId=14647478#comment-14647478
] 

Hive QA commented on HIVE-11383:
--------------------------------



{color:red}Overall{color}: -1 no tests executed

Here are the results of testing the latest attachment:
https://issues.apache.org/jira/secure/attachment/12747964/HIVE-11383.7.patch

Test results: http://ec2-174-129-184-35.compute-1.amazonaws.com/jenkins/job/PreCommit-HIVE-TRUNK-Build/4759/testReport
Console output: http://ec2-174-129-184-35.compute-1.amazonaws.com/jenkins/job/PreCommit-HIVE-TRUNK-Build/4759/console
Test logs: http://ec2-174-129-184-35.compute-1.amazonaws.com/logs/PreCommit-HIVE-TRUNK-Build-4759/

Messages:
{noformat}
**** This message was trimmed, see log for full details ****
3426/3551 KB   
3430/3551 KB   
3434/3551 KB   
3438/3551 KB   
3442/3551 KB   
3446/3551 KB   
3450/3551 KB   
3454/3551 KB   
3458/3551 KB   
3462/3551 KB   
3466/3551 KB   
3470/3551 KB   
3474/3551 KB   
3478/3551 KB   
3482/3551 KB   
3486/3551 KB   
3490/3551 KB   
3494/3551 KB   
3498/3551 KB   
3502/3551 KB   
3506/3551 KB   
3510/3551 KB   
3514/3551 KB   
3518/3551 KB   
3522/3551 KB   
3526/3551 KB   
3530/3551 KB   
3534/3551 KB   
3538/3551 KB   
3542/3551 KB   
3546/3551 KB   
3550/3551 KB   
3551/3551 KB   
               
Downloaded: http://repository.apache.org/snapshots/org/apache/calcite/calcite-core/1.4.0-incubating-SNAPSHOT/calcite-core-1.4.0-incubating-20150729.211031-2.jar
(3551 KB at 1005.9 KB/sec)
[INFO] 
[INFO] --- maven-clean-plugin:2.5:clean (default-clean) @ hive-exec ---
[INFO] Deleting /data/hive-ptest/working/apache-github-source-source/ql/target
[INFO] Deleting /data/hive-ptest/working/apache-github-source-source/ql (includes = [datanucleus.log,
derby.log], excludes = [])
[INFO] 
[INFO] --- maven-enforcer-plugin:1.3.1:enforce (enforce-no-snapshots) @ hive-exec ---
[INFO] 
[INFO] --- maven-antrun-plugin:1.7:run (generate-sources) @ hive-exec ---
[INFO] Executing tasks

main:
    [mkdir] Created dir: /data/hive-ptest/working/apache-github-source-source/ql/target/generated-sources/java/org/apache/hadoop/hive/ql/exec/vector/expressions/gen
    [mkdir] Created dir: /data/hive-ptest/working/apache-github-source-source/ql/target/generated-sources/java/org/apache/hadoop/hive/ql/exec/vector/expressions/aggregates/gen
    [mkdir] Created dir: /data/hive-ptest/working/apache-github-source-source/ql/target/generated-test-sources/java/org/apache/hadoop/hive/ql/exec/vector/expressions/gen
Generating vector expression code
Generating vector expression test code
[INFO] Executed tasks
[INFO] 
[INFO] --- build-helper-maven-plugin:1.8:add-source (add-source) @ hive-exec ---
[INFO] Source directory: /data/hive-ptest/working/apache-github-source-source/ql/src/gen/protobuf/gen-java
added.
[INFO] Source directory: /data/hive-ptest/working/apache-github-source-source/ql/src/gen/thrift/gen-javabean
added.
[INFO] Source directory: /data/hive-ptest/working/apache-github-source-source/ql/target/generated-sources/java
added.
[INFO] 
[INFO] --- antlr3-maven-plugin:3.4:antlr (default) @ hive-exec ---
[INFO] ANTLR: Processing source directory /data/hive-ptest/working/apache-github-source-source/ql/src/java
ANTLR Parser Generator  Version 3.4
org/apache/hadoop/hive/ql/parse/HiveLexer.g
org/apache/hadoop/hive/ql/parse/HiveParser.g
warning(200): IdentifiersParser.g:455:5: 
Decision can match input such as "{KW_REGEXP, KW_RLIKE} KW_DISTRIBUTE KW_BY" using multiple
alternatives: 2, 9

As a result, alternative(s) 9 were disabled for that input
warning(200): IdentifiersParser.g:455:5: 
Decision can match input such as "{KW_REGEXP, KW_RLIKE} KW_UNION KW_ALL" using multiple alternatives:
2, 9

As a result, alternative(s) 9 were disabled for that input
warning(200): IdentifiersParser.g:455:5: 
Decision can match input such as "{KW_REGEXP, KW_RLIKE} KW_MAP LPAREN" using multiple alternatives:
2, 9

As a result, alternative(s) 9 were disabled for that input
warning(200): IdentifiersParser.g:455:5: 
Decision can match input such as "{KW_REGEXP, KW_RLIKE} KW_UNION KW_MAP" using multiple alternatives:
2, 9

As a result, alternative(s) 9 were disabled for that input
warning(200): IdentifiersParser.g:455:5: 
Decision can match input such as "{KW_REGEXP, KW_RLIKE} KW_INSERT KW_OVERWRITE" using multiple
alternatives: 2, 9

As a result, alternative(s) 9 were disabled for that input
warning(200): IdentifiersParser.g:455:5: 
Decision can match input such as "{KW_REGEXP, KW_RLIKE} KW_UNION KW_SELECT" using multiple
alternatives: 2, 9

As a result, alternative(s) 9 were disabled for that input
warning(200): IdentifiersParser.g:455:5: 
Decision can match input such as "{KW_REGEXP, KW_RLIKE} KW_UNION KW_REDUCE" using multiple
alternatives: 2, 9

As a result, alternative(s) 9 were disabled for that input
warning(200): IdentifiersParser.g:455:5: 
Decision can match input such as "{KW_REGEXP, KW_RLIKE} KW_LATERAL KW_VIEW" using multiple
alternatives: 2, 9

As a result, alternative(s) 9 were disabled for that input
warning(200): IdentifiersParser.g:455:5: 
Decision can match input such as "{KW_REGEXP, KW_RLIKE} KW_INSERT KW_INTO" using multiple
alternatives: 2, 9

As a result, alternative(s) 9 were disabled for that input
warning(200): IdentifiersParser.g:455:5: 
Decision can match input such as "{KW_REGEXP, KW_RLIKE} KW_ORDER KW_BY" using multiple alternatives:
2, 9

As a result, alternative(s) 9 were disabled for that input
warning(200): IdentifiersParser.g:455:5: 
Decision can match input such as "{KW_REGEXP, KW_RLIKE} KW_CLUSTER KW_BY" using multiple alternatives:
2, 9

As a result, alternative(s) 9 were disabled for that input
warning(200): IdentifiersParser.g:455:5: 
Decision can match input such as "{KW_REGEXP, KW_RLIKE} KW_GROUP KW_BY" using multiple alternatives:
2, 9

As a result, alternative(s) 9 were disabled for that input
warning(200): IdentifiersParser.g:455:5: 
Decision can match input such as "{KW_REGEXP, KW_RLIKE} KW_UNION KW_FROM" using multiple alternatives:
2, 9

As a result, alternative(s) 9 were disabled for that input
warning(200): IdentifiersParser.g:455:5: 
Decision can match input such as "{KW_REGEXP, KW_RLIKE} KW_SORT KW_BY" using multiple alternatives:
2, 9

As a result, alternative(s) 9 were disabled for that input
[INFO] 
[INFO] --- maven-remote-resources-plugin:1.5:process (default) @ hive-exec ---
Downloading: http://conjars.org/repo/org/apache/calcite/calcite/1.4.0-incubating-SNAPSHOT/maven-metadata.xml
               
[INFO] 
[INFO] --- maven-resources-plugin:2.6:resources (default-resources) @ hive-exec ---
[INFO] Using 'UTF-8' encoding to copy filtered resources.
[INFO] Copying 2 resources
[INFO] Copying 3 resources
[INFO] 
[INFO] --- maven-antrun-plugin:1.7:run (define-classpath) @ hive-exec ---
[INFO] Executing tasks

main:
[INFO] Executed tasks
[INFO] 
[INFO] --- maven-compiler-plugin:2.3.2:compile (default-compile) @ hive-exec ---
[INFO] Compiling 2399 source files to /data/hive-ptest/working/apache-github-source-source/ql/target/classes
[INFO] -------------------------------------------------------------
[ERROR] COMPILATION ERROR : 
[INFO] -------------------------------------------------------------
[ERROR] /data/hive-ptest/working/apache-github-source-source/ql/src/java/org/apache/hadoop/hive/ql/optimizer/calcite/rules/HiveJoinProjectTransposeRule.java:[240,15]
error: createProjectExprs(Project,RelNode,int,RexBuilder,List<RelDataTypeField>,List<Pair<RexNode,String>>)
in HiveJoinProjectTransposeRule cannot override createProjectExprs(Project,RelNode,int,RexBuilder,List<RelDataTypeField>,List<Pair<RexNode,String>>)
in JoinProjectTransposeRule
[INFO] 1 error
[INFO] -------------------------------------------------------------
[INFO] ------------------------------------------------------------------------
[INFO] Reactor Summary:
[INFO] 
[INFO] Hive .............................................. SUCCESS [14.517s]
[INFO] Hive Shims Common ................................. SUCCESS [11.835s]
[INFO] Hive Shims 0.20S .................................. SUCCESS [2.950s]
[INFO] Hive Shims 0.23 ................................... SUCCESS [10.714s]
[INFO] Hive Shims Scheduler .............................. SUCCESS [2.227s]
[INFO] Hive Shims ........................................ SUCCESS [2.238s]
[INFO] Hive Storage API .................................. SUCCESS [2.423s]
[INFO] Hive Common ....................................... SUCCESS [17.391s]
[INFO] Hive Serde ........................................ SUCCESS [17.197s]
[INFO] Hive Metastore .................................... SUCCESS [36.857s]
[INFO] Hive Ant Utilities ................................ SUCCESS [1.876s]
[INFO] Spark Remote Client ............................... SUCCESS [22.665s]
[INFO] Hive Query Language ............................... FAILURE [1:52.869s]
[INFO] Hive Service ...................................... SKIPPED
[INFO] Hive Accumulo Handler ............................. SKIPPED
[INFO] Hive JDBC ......................................... SKIPPED
[INFO] Hive Beeline ...................................... SKIPPED
[INFO] Hive CLI .......................................... SKIPPED
[INFO] Hive Contrib ...................................... SKIPPED
[INFO] Hive HBase Handler ................................ SKIPPED
[INFO] Hive HCatalog ..................................... SKIPPED
[INFO] Hive HCatalog Core ................................ SKIPPED
[INFO] Hive HCatalog Pig Adapter ......................... SKIPPED
[INFO] Hive HCatalog Server Extensions ................... SKIPPED
[INFO] Hive HCatalog Webhcat Java Client ................. SKIPPED
[INFO] Hive HCatalog Webhcat ............................. SKIPPED
[INFO] Hive HCatalog Streaming ........................... SKIPPED
[INFO] Hive HPL/SQL ...................................... SKIPPED
[INFO] Hive HWI .......................................... SKIPPED
[INFO] Hive ODBC ......................................... SKIPPED
[INFO] Hive Shims Aggregator ............................. SKIPPED
[INFO] Hive TestUtils .................................... SKIPPED
[INFO] Hive Packaging .................................... SKIPPED
[INFO] ------------------------------------------------------------------------
[INFO] BUILD FAILURE
[INFO] ------------------------------------------------------------------------
[INFO] Total time: 4:19.119s
[INFO] Finished at: Thu Jul 30 07:06:14 EDT 2015
[INFO] Final Memory: 111M/642M
[INFO] ------------------------------------------------------------------------
[ERROR] Failed to execute goal org.apache.maven.plugins:maven-compiler-plugin:2.3.2:compile
(default-compile) on project hive-exec: Compilation failure
[ERROR] /data/hive-ptest/working/apache-github-source-source/ql/src/java/org/apache/hadoop/hive/ql/optimizer/calcite/rules/HiveJoinProjectTransposeRule.java:[240,15]
error: createProjectExprs(Project,RelNode,int,RexBuilder,List<RelDataTypeField>,List<Pair<RexNode,String>>)
in HiveJoinProjectTransposeRule cannot override createProjectExprs(Project,RelNode,int,RexBuilder,List<RelDataTypeField>,List<Pair<RexNode,String>>)
in JoinProjectTransposeRule
[ERROR] -> [Help 1]
[ERROR] 
[ERROR] To see the full stack trace of the errors, re-run Maven with the -e switch.
[ERROR] Re-run Maven using the -X switch to enable full debug logging.
[ERROR] 
[ERROR] For more information about the errors and possible solutions, please read the following
articles:
[ERROR] [Help 1] http://cwiki.apache.org/confluence/display/MAVEN/MojoFailureException
[ERROR] 
[ERROR] After correcting the problems, you can resume the build with the command
[ERROR]   mvn <goals> -rf :hive-exec
+ exit 1
'
{noformat}

This message is automatically generated.

ATTACHMENT ID: 12747964 - PreCommit-HIVE-TRUNK-Build

> Upgrade Hive to Calcite 1.4
> ---------------------------
>
>                 Key: HIVE-11383
>                 URL: https://issues.apache.org/jira/browse/HIVE-11383
>             Project: Hive
>          Issue Type: Bug
>            Reporter: Julian Hyde
>            Assignee: Jesus Camacho Rodriguez
>         Attachments: HIVE-11383.1.patch, HIVE-11383.2.patch, HIVE-11383.3.patch, HIVE-11383.3.patch,
HIVE-11383.3.patch, HIVE-11383.4.patch, HIVE-11383.5.patch, HIVE-11383.6.patch, HIVE-11383.7.patch
>
>
> CLEAR LIBRARY CACHE
> Upgrade Hive to Calcite 1.4.0-incubating.
> There is currently a snapshot release, which is close to what will be in 1.4. I have
checked that Hive compiles against the new snapshot, fixing one issue. The patch is attached.
> Next step is to validate that Hive runs against the new Calcite, and post any issues
to the Calcite list or log Calcite Jira cases. [~jcamachorodriguez], can you please do that.
> [~pxiong], I gather you are dependent on CALCITE-814, which will be fixed in the new
Calcite version.



--
This message was sent by Atlassian JIRA
(v6.3.4#6332)

Mime
View raw message