hive-issues mailing list archives

Site index · List index
Message view « Date » · « Thread »
Top « Date » · « Thread »
From "Hive QA (JIRA)" <j...@apache.org>
Subject [jira] [Commented] (HIVE-11139) Emit more lineage information
Date Tue, 30 Jun 2015 21:42:05 GMT

    [ https://issues.apache.org/jira/browse/HIVE-11139?page=com.atlassian.jira.plugin.system.issuetabpanels:comment-tabpanel&focusedCommentId=14609129#comment-14609129
] 

Hive QA commented on HIVE-11139:
--------------------------------



{color:red}Overall{color}: -1 no tests executed

Here are the results of testing the latest attachment:
https://issues.apache.org/jira/secure/attachment/12742613/HIVE-11139.1.patch

Test results: http://ec2-174-129-184-35.compute-1.amazonaws.com/jenkins/job/PreCommit-HIVE-TRUNK-Build/4448/testReport
Console output: http://ec2-174-129-184-35.compute-1.amazonaws.com/jenkins/job/PreCommit-HIVE-TRUNK-Build/4448/console
Test logs: http://ec2-174-129-184-35.compute-1.amazonaws.com/logs/PreCommit-HIVE-TRUNK-Build-4448/

Messages:
{noformat}
**** This message was trimmed, see log for full details ****
     [copy] Copying 11 files to /data/hive-ptest/working/apache-github-source-source/spark-client/target/tmp/conf
[INFO] Executed tasks
[INFO] 
[INFO] --- maven-compiler-plugin:3.1:testCompile (default-testCompile) @ spark-client ---
[INFO] Compiling 5 source files to /data/hive-ptest/working/apache-github-source-source/spark-client/target/test-classes
[INFO] 
[INFO] --- maven-dependency-plugin:2.8:copy (copy-guava-14) @ spark-client ---
[INFO] Configured Artifact: com.google.guava:guava:14.0.1:jar
[INFO] Copying guava-14.0.1.jar to /data/hive-ptest/working/apache-github-source-source/spark-client/target/dependency/guava-14.0.1.jar
[INFO] 
[INFO] --- maven-surefire-plugin:2.16:test (default-test) @ spark-client ---
[INFO] Tests are skipped.
[INFO] 
[INFO] --- maven-jar-plugin:2.2:jar (default-jar) @ spark-client ---
[INFO] Building jar: /data/hive-ptest/working/apache-github-source-source/spark-client/target/spark-client-2.0.0-SNAPSHOT.jar
[INFO] 
[INFO] --- maven-site-plugin:3.3:attach-descriptor (attach-descriptor) @ spark-client ---
[INFO] 
[INFO] --- maven-install-plugin:2.4:install (default-install) @ spark-client ---
[INFO] Installing /data/hive-ptest/working/apache-github-source-source/spark-client/target/spark-client-2.0.0-SNAPSHOT.jar
to /home/hiveptest/.m2/repository/org/apache/hive/spark-client/2.0.0-SNAPSHOT/spark-client-2.0.0-SNAPSHOT.jar
[INFO] Installing /data/hive-ptest/working/apache-github-source-source/spark-client/pom.xml
to /home/hiveptest/.m2/repository/org/apache/hive/spark-client/2.0.0-SNAPSHOT/spark-client-2.0.0-SNAPSHOT.pom
[INFO]                                                                         
[INFO] ------------------------------------------------------------------------
[INFO] Building Hive Query Language 2.0.0-SNAPSHOT
[INFO] ------------------------------------------------------------------------
[INFO] 
[INFO] --- maven-clean-plugin:2.5:clean (default-clean) @ hive-exec ---
[INFO] Deleting /data/hive-ptest/working/apache-github-source-source/ql/target
[INFO] Deleting /data/hive-ptest/working/apache-github-source-source/ql (includes = [datanucleus.log,
derby.log], excludes = [])
[INFO] 
[INFO] --- maven-enforcer-plugin:1.3.1:enforce (enforce-no-snapshots) @ hive-exec ---
[INFO] 
[INFO] --- maven-antrun-plugin:1.7:run (generate-sources) @ hive-exec ---
[INFO] Executing tasks

main:
    [mkdir] Created dir: /data/hive-ptest/working/apache-github-source-source/ql/target/generated-sources/java/org/apache/hadoop/hive/ql/exec/vector/expressions/gen
    [mkdir] Created dir: /data/hive-ptest/working/apache-github-source-source/ql/target/generated-sources/java/org/apache/hadoop/hive/ql/exec/vector/expressions/aggregates/gen
    [mkdir] Created dir: /data/hive-ptest/working/apache-github-source-source/ql/target/generated-test-sources/java/org/apache/hadoop/hive/ql/exec/vector/expressions/gen
Generating vector expression code
Generating vector expression test code
[INFO] Executed tasks
[INFO] 
[INFO] --- build-helper-maven-plugin:1.8:add-source (add-source) @ hive-exec ---
[INFO] Source directory: /data/hive-ptest/working/apache-github-source-source/ql/src/gen/protobuf/gen-java
added.
[INFO] Source directory: /data/hive-ptest/working/apache-github-source-source/ql/src/gen/thrift/gen-javabean
added.
[INFO] Source directory: /data/hive-ptest/working/apache-github-source-source/ql/target/generated-sources/java
added.
[INFO] 
[INFO] --- antlr3-maven-plugin:3.4:antlr (default) @ hive-exec ---
[INFO] ANTLR: Processing source directory /data/hive-ptest/working/apache-github-source-source/ql/src/java
ANTLR Parser Generator  Version 3.4
org/apache/hadoop/hive/ql/parse/HiveLexer.g
org/apache/hadoop/hive/ql/parse/HiveParser.g
warning(200): IdentifiersParser.g:455:5: 
Decision can match input such as "{KW_REGEXP, KW_RLIKE} KW_UNION KW_MAP" using multiple alternatives:
2, 9

As a result, alternative(s) 9 were disabled for that input
warning(200): IdentifiersParser.g:455:5: 
Decision can match input such as "{KW_REGEXP, KW_RLIKE} KW_UNION KW_SELECT" using multiple
alternatives: 2, 9

As a result, alternative(s) 9 were disabled for that input
warning(200): IdentifiersParser.g:455:5: 
Decision can match input such as "{KW_REGEXP, KW_RLIKE} KW_SORT KW_BY" using multiple alternatives:
2, 9

As a result, alternative(s) 9 were disabled for that input
warning(200): IdentifiersParser.g:455:5: 
Decision can match input such as "{KW_REGEXP, KW_RLIKE} KW_MAP LPAREN" using multiple alternatives:
2, 9

As a result, alternative(s) 9 were disabled for that input
warning(200): IdentifiersParser.g:455:5: 
Decision can match input such as "{KW_REGEXP, KW_RLIKE} KW_DISTRIBUTE KW_BY" using multiple
alternatives: 2, 9

As a result, alternative(s) 9 were disabled for that input
warning(200): IdentifiersParser.g:455:5: 
Decision can match input such as "{KW_REGEXP, KW_RLIKE} KW_UNION KW_ALL" using multiple alternatives:
2, 9

As a result, alternative(s) 9 were disabled for that input
warning(200): IdentifiersParser.g:455:5: 
Decision can match input such as "{KW_REGEXP, KW_RLIKE} KW_UNION KW_REDUCE" using multiple
alternatives: 2, 9

As a result, alternative(s) 9 were disabled for that input
warning(200): IdentifiersParser.g:455:5: 
Decision can match input such as "{KW_REGEXP, KW_RLIKE} KW_CLUSTER KW_BY" using multiple alternatives:
2, 9

As a result, alternative(s) 9 were disabled for that input
warning(200): IdentifiersParser.g:455:5: 
Decision can match input such as "{KW_REGEXP, KW_RLIKE} KW_LATERAL KW_VIEW" using multiple
alternatives: 2, 9

As a result, alternative(s) 9 were disabled for that input
warning(200): IdentifiersParser.g:455:5: 
Decision can match input such as "{KW_REGEXP, KW_RLIKE} KW_GROUP KW_BY" using multiple alternatives:
2, 9

As a result, alternative(s) 9 were disabled for that input
warning(200): IdentifiersParser.g:455:5: 
Decision can match input such as "{KW_REGEXP, KW_RLIKE} KW_ORDER KW_BY" using multiple alternatives:
2, 9

As a result, alternative(s) 9 were disabled for that input
warning(200): IdentifiersParser.g:455:5: 
Decision can match input such as "{KW_REGEXP, KW_RLIKE} KW_UNION KW_FROM" using multiple alternatives:
2, 9

As a result, alternative(s) 9 were disabled for that input
warning(200): IdentifiersParser.g:455:5: 
Decision can match input such as "{KW_REGEXP, KW_RLIKE} KW_INSERT KW_INTO" using multiple
alternatives: 2, 9

As a result, alternative(s) 9 were disabled for that input
warning(200): IdentifiersParser.g:455:5: 
Decision can match input such as "{KW_REGEXP, KW_RLIKE} KW_INSERT KW_OVERWRITE" using multiple
alternatives: 2, 9

As a result, alternative(s) 9 were disabled for that input
[INFO] 
[INFO] --- maven-remote-resources-plugin:1.5:process (default) @ hive-exec ---
[INFO] 
[INFO] --- maven-resources-plugin:2.6:resources (default-resources) @ hive-exec ---
[INFO] Using 'UTF-8' encoding to copy filtered resources.
[INFO] Copying 2 resources
[INFO] Copying 3 resources
[INFO] 
[INFO] --- maven-antrun-plugin:1.7:run (define-classpath) @ hive-exec ---
[INFO] Executing tasks

main:
[INFO] Executed tasks
[INFO] 
[INFO] --- maven-compiler-plugin:2.3.2:compile (default-compile) @ hive-exec ---
[INFO] Compiling 2398 source files to /data/hive-ptest/working/apache-github-source-source/ql/target/classes
[INFO] -------------------------------------------------------------
[ERROR] COMPILATION ERROR : 
[INFO] -------------------------------------------------------------
[ERROR] /data/hive-ptest/working/apache-github-source-source/ql/src/java/org/apache/hadoop/hive/ql/hooks/LineageLogger.java:[55,29]
error: package com.google.gson.stream does not exist
[ERROR] /data/hive-ptest/working/apache-github-source-source/ql/src/java/org/apache/hadoop/hive/ql/hooks/LineageLogger.java:[388,26]
error: cannot find symbol
[ERROR]  class LineageLogger
/data/hive-ptest/working/apache-github-source-source/ql/src/java/org/apache/hadoop/hive/ql/hooks/LineageLogger.java:[417,29]
error: cannot find symbol
[ERROR]  class LineageLogger
/data/hive-ptest/working/apache-github-source-source/ql/src/java/org/apache/hadoop/hive/ql/hooks/LineageLogger.java:[133,8]
error: cannot find symbol
[ERROR]  class LineageLogger
/data/hive-ptest/working/apache-github-source-source/ql/src/java/org/apache/hadoop/hive/ql/hooks/LineageLogger.java:[133,32]
error: cannot find symbol
[INFO] 5 errors 
[INFO] -------------------------------------------------------------
[INFO] ------------------------------------------------------------------------
[INFO] Reactor Summary:
[INFO] 
[INFO] Hive .............................................. SUCCESS [14.000s]
[INFO] Hive Shims Common ................................. SUCCESS [12.807s]
[INFO] Hive Shims 0.20S .................................. SUCCESS [3.365s]
[INFO] Hive Shims 0.23 ................................... SUCCESS [11.778s]
[INFO] Hive Shims Scheduler .............................. SUCCESS [2.257s]
[INFO] Hive Shims ........................................ SUCCESS [2.351s]
[INFO] Hive Common ....................................... SUCCESS [16.371s]
[INFO] Hive Serde ........................................ SUCCESS [17.916s]
[INFO] Hive Metastore .................................... SUCCESS [36.932s]
[INFO] Hive Ant Utilities ................................ SUCCESS [2.773s]
[INFO] Spark Remote Client ............................... SUCCESS [19.614s]
[INFO] Hive Query Language ............................... FAILURE [1:23.566s]
[INFO] Hive Service ...................................... SKIPPED
[INFO] Hive Accumulo Handler ............................. SKIPPED
[INFO] Hive JDBC ......................................... SKIPPED
[INFO] Hive Beeline ...................................... SKIPPED
[INFO] Hive CLI .......................................... SKIPPED
[INFO] Hive Contrib ...................................... SKIPPED
[INFO] Hive HBase Handler ................................ SKIPPED
[INFO] Hive HCatalog ..................................... SKIPPED
[INFO] Hive HCatalog Core ................................ SKIPPED
[INFO] Hive HCatalog Pig Adapter ......................... SKIPPED
[INFO] Hive HCatalog Server Extensions ................... SKIPPED
[INFO] Hive HCatalog Webhcat Java Client ................. SKIPPED
[INFO] Hive HCatalog Webhcat ............................. SKIPPED
[INFO] Hive HCatalog Streaming ........................... SKIPPED
[INFO] Hive HWI .......................................... SKIPPED
[INFO] Hive ODBC ......................................... SKIPPED
[INFO] Hive Shims Aggregator ............................. SKIPPED
[INFO] Hive TestUtils .................................... SKIPPED
[INFO] Hive Packaging .................................... SKIPPED
[INFO] ------------------------------------------------------------------------
[INFO] BUILD FAILURE
[INFO] ------------------------------------------------------------------------
[INFO] Total time: 3:46.802s
[INFO] Finished at: Tue Jun 30 17:41:54 EDT 2015
[INFO] Final Memory: 104M/708M
[INFO] ------------------------------------------------------------------------
[ERROR] Failed to execute goal org.apache.maven.plugins:maven-compiler-plugin:2.3.2:compile
(default-compile) on project hive-exec: Compilation failure: Compilation failure:
[ERROR] /data/hive-ptest/working/apache-github-source-source/ql/src/java/org/apache/hadoop/hive/ql/hooks/LineageLogger.java:[55,29]
error: package com.google.gson.stream does not exist
[ERROR] /data/hive-ptest/working/apache-github-source-source/ql/src/java/org/apache/hadoop/hive/ql/hooks/LineageLogger.java:[388,26]
error: cannot find symbol
[ERROR] class LineageLogger
[ERROR] /data/hive-ptest/working/apache-github-source-source/ql/src/java/org/apache/hadoop/hive/ql/hooks/LineageLogger.java:[417,29]
error: cannot find symbol
[ERROR] class LineageLogger
[ERROR] /data/hive-ptest/working/apache-github-source-source/ql/src/java/org/apache/hadoop/hive/ql/hooks/LineageLogger.java:[133,8]
error: cannot find symbol
[ERROR] class LineageLogger
[ERROR] /data/hive-ptest/working/apache-github-source-source/ql/src/java/org/apache/hadoop/hive/ql/hooks/LineageLogger.java:[133,32]
error: cannot find symbol
[ERROR] -> [Help 1]
[ERROR] 
[ERROR] To see the full stack trace of the errors, re-run Maven with the -e switch.
[ERROR] Re-run Maven using the -X switch to enable full debug logging.
[ERROR] 
[ERROR] For more information about the errors and possible solutions, please read the following
articles:
[ERROR] [Help 1] http://cwiki.apache.org/confluence/display/MAVEN/MojoFailureException
[ERROR] 
[ERROR] After correcting the problems, you can resume the build with the command
[ERROR]   mvn <goals> -rf :hive-exec
+ exit 1
'
{noformat}

This message is automatically generated.

ATTACHMENT ID: 12742613 - PreCommit-HIVE-TRUNK-Build

> Emit more lineage information
> -----------------------------
>
>                 Key: HIVE-11139
>                 URL: https://issues.apache.org/jira/browse/HIVE-11139
>             Project: Hive
>          Issue Type: Improvement
>            Reporter: Jimmy Xiang
>            Assignee: Jimmy Xiang
>             Fix For: 2.0.0
>
>         Attachments: HIVE-11139.1.patch
>
>
> HIVE-1131 emits some column lineage info. But it doesn't support INSERT statements, or
CTAS statements. It doesn't emit the predicate information either.
> We can enhance and use the dependency information created in HIVE-1131, generate more
complete lineage info.



--
This message was sent by Atlassian JIRA
(v6.3.4#6332)

Mime
View raw message