hive-issues mailing list archives

Site index · List index
Message view « Date » · « Thread »
Top « Date » · « Thread »
From "Hive QA (JIRA)" <j...@apache.org>
Subject [jira] [Commented] (HIVE-10975) Parquet: Bump the parquet version up to 1.8.0rc2-SNAPSHOT
Date Wed, 10 Jun 2015 13:20:00 GMT

    [ https://issues.apache.org/jira/browse/HIVE-10975?page=com.atlassian.jira.plugin.system.issuetabpanels:comment-tabpanel&focusedCommentId=14580515#comment-14580515
] 

Hive QA commented on HIVE-10975:
--------------------------------



{color:red}Overall{color}: -1 no tests executed

Here are the results of testing the latest attachment:
https://issues.apache.org/jira/secure/attachment/12738821/HIVE-10975.1-parquet.patch

Test results: http://ec2-174-129-184-35.compute-1.amazonaws.com/jenkins/job/PreCommit-HIVE-PARQUET-Build/15/testReport
Console output: http://ec2-174-129-184-35.compute-1.amazonaws.com/jenkins/job/PreCommit-HIVE-PARQUET-Build/15/console
Test logs: http://ec2-174-129-184-35.compute-1.amazonaws.com/logs/PreCommit-HIVE-PARQUET-Build-15/

Messages:
{noformat}
**** This message was trimmed, see log for full details ****
[INFO] 
[INFO] --- maven-surefire-plugin:2.16:test (default-test) @ hive-shims-scheduler ---
[INFO] Tests are skipped.
[INFO] 
[INFO] --- maven-jar-plugin:2.2:jar (default-jar) @ hive-shims-scheduler ---
[INFO] Building jar: /data/hive-ptest/working/apache-git-parquet-source/shims/scheduler/target/hive-shims-scheduler-1.3.0-SNAPSHOT.jar
[INFO] 
[INFO] --- maven-site-plugin:3.3:attach-descriptor (attach-descriptor) @ hive-shims-scheduler
---
[INFO] 
[INFO] --- maven-install-plugin:2.4:install (default-install) @ hive-shims-scheduler ---
[INFO] Installing /data/hive-ptest/working/apache-git-parquet-source/shims/scheduler/target/hive-shims-scheduler-1.3.0-SNAPSHOT.jar
to /data/hive-ptest/working/maven/org/apache/hive/shims/hive-shims-scheduler/1.3.0-SNAPSHOT/hive-shims-scheduler-1.3.0-SNAPSHOT.jar
[INFO] Installing /data/hive-ptest/working/apache-git-parquet-source/shims/scheduler/pom.xml
to /data/hive-ptest/working/maven/org/apache/hive/shims/hive-shims-scheduler/1.3.0-SNAPSHOT/hive-shims-scheduler-1.3.0-SNAPSHOT.pom
[INFO]                                                                         
[INFO] ------------------------------------------------------------------------
[INFO] Building Hive Shims 1.3.0-SNAPSHOT
[INFO] ------------------------------------------------------------------------
[INFO] 
[INFO] --- maven-clean-plugin:2.5:clean (default-clean) @ hive-shims ---
[INFO] Deleting /data/hive-ptest/working/apache-git-parquet-source/shims/aggregator/target
[INFO] Deleting /data/hive-ptest/working/apache-git-parquet-source/shims/aggregator (includes
= [datanucleus.log, derby.log], excludes = [])
[INFO] 
[INFO] --- maven-enforcer-plugin:1.3.1:enforce (enforce-no-snapshots) @ hive-shims ---
[INFO] 
[INFO] --- maven-remote-resources-plugin:1.5:process (default) @ hive-shims ---
[INFO] 
[INFO] --- maven-resources-plugin:2.6:resources (default-resources) @ hive-shims ---
[INFO] Using 'UTF-8' encoding to copy filtered resources.
[INFO] skip non existing resourceDirectory /data/hive-ptest/working/apache-git-parquet-source/shims/aggregator/src/main/resources
[INFO] Copying 3 resources
[INFO] 
[INFO] --- maven-antrun-plugin:1.7:run (define-classpath) @ hive-shims ---
[INFO] Executing tasks

main:
[INFO] Executed tasks
[INFO] 
[INFO] --- maven-compiler-plugin:3.1:compile (default-compile) @ hive-shims ---
[INFO] No sources to compile
[INFO] 
[INFO] --- maven-resources-plugin:2.6:testResources (default-testResources) @ hive-shims ---
[INFO] Using 'UTF-8' encoding to copy filtered resources.
[INFO] skip non existing resourceDirectory /data/hive-ptest/working/apache-git-parquet-source/shims/aggregator/src/test/resources
[INFO] Copying 3 resources
[INFO] 
[INFO] --- maven-antrun-plugin:1.7:run (setup-test-dirs) @ hive-shims ---
[INFO] Executing tasks

main:
    [mkdir] Created dir: /data/hive-ptest/working/apache-git-parquet-source/shims/aggregator/target/tmp
    [mkdir] Created dir: /data/hive-ptest/working/apache-git-parquet-source/shims/aggregator/target/warehouse
    [mkdir] Created dir: /data/hive-ptest/working/apache-git-parquet-source/shims/aggregator/target/tmp/conf
     [copy] Copying 11 files to /data/hive-ptest/working/apache-git-parquet-source/shims/aggregator/target/tmp/conf
[INFO] Executed tasks
[INFO] 
[INFO] --- maven-compiler-plugin:3.1:testCompile (default-testCompile) @ hive-shims ---
[INFO] No sources to compile
[INFO] 
[INFO] --- maven-surefire-plugin:2.16:test (default-test) @ hive-shims ---
[INFO] Tests are skipped.
[INFO] 
[INFO] --- maven-jar-plugin:2.2:jar (default-jar) @ hive-shims ---
[INFO] Building jar: /data/hive-ptest/working/apache-git-parquet-source/shims/aggregator/target/hive-shims-1.3.0-SNAPSHOT.jar
[INFO] 
[INFO] --- maven-site-plugin:3.3:attach-descriptor (attach-descriptor) @ hive-shims ---
[INFO] 
[INFO] --- maven-install-plugin:2.4:install (default-install) @ hive-shims ---
[INFO] Installing /data/hive-ptest/working/apache-git-parquet-source/shims/aggregator/target/hive-shims-1.3.0-SNAPSHOT.jar
to /data/hive-ptest/working/maven/org/apache/hive/hive-shims/1.3.0-SNAPSHOT/hive-shims-1.3.0-SNAPSHOT.jar
[INFO] Installing /data/hive-ptest/working/apache-git-parquet-source/shims/aggregator/pom.xml
to /data/hive-ptest/working/maven/org/apache/hive/hive-shims/1.3.0-SNAPSHOT/hive-shims-1.3.0-SNAPSHOT.pom
[INFO]                                                                         
[INFO] ------------------------------------------------------------------------
[INFO] Building Hive Common 1.3.0-SNAPSHOT
[INFO] ------------------------------------------------------------------------
[INFO] 
[INFO] --- maven-clean-plugin:2.5:clean (default-clean) @ hive-common ---
[INFO] Deleting /data/hive-ptest/working/apache-git-parquet-source/common/target
[INFO] Deleting /data/hive-ptest/working/apache-git-parquet-source/common (includes = [datanucleus.log,
derby.log], excludes = [])
[INFO] 
[INFO] --- maven-enforcer-plugin:1.3.1:enforce (enforce-no-snapshots) @ hive-common ---
[INFO] 
[INFO] --- maven-antrun-plugin:1.7:run (generate-version-annotation) @ hive-common ---
[INFO] Executing tasks

main:
[INFO] Executed tasks
[INFO] 
[INFO] --- build-helper-maven-plugin:1.8:add-source (add-source) @ hive-common ---
[INFO] Source directory: /data/hive-ptest/working/apache-git-parquet-source/common/src/gen
added.
[INFO] 
[INFO] --- maven-remote-resources-plugin:1.5:process (default) @ hive-common ---
[INFO] 
[INFO] --- maven-resources-plugin:2.6:resources (default-resources) @ hive-common ---
[INFO] Using 'UTF-8' encoding to copy filtered resources.
[INFO] Copying 1 resource
[INFO] Copying 3 resources
[INFO] 
[INFO] --- maven-antrun-plugin:1.7:run (define-classpath) @ hive-common ---
[INFO] Executing tasks

main:
[INFO] Executed tasks
[INFO] 
[INFO] --- maven-compiler-plugin:3.1:compile (default-compile) @ hive-common ---
[INFO] Compiling 69 source files to /data/hive-ptest/working/apache-git-parquet-source/common/target/classes
[WARNING] /data/hive-ptest/working/apache-git-parquet-source/common/src/java/org/apache/hadoop/hive/common/FileUtils.java:
/data/hive-ptest/working/apache-git-parquet-source/common/src/java/org/apache/hadoop/hive/common/FileUtils.java
uses or overrides a deprecated API.
[WARNING] /data/hive-ptest/working/apache-git-parquet-source/common/src/java/org/apache/hadoop/hive/common/FileUtils.java:
Recompile with -Xlint:deprecation for details.
[WARNING] /data/hive-ptest/working/apache-git-parquet-source/common/src/java/org/apache/hive/common/util/HiveStringUtils.java:
Some input files use unchecked or unsafe operations.
[WARNING] /data/hive-ptest/working/apache-git-parquet-source/common/src/java/org/apache/hive/common/util/HiveStringUtils.java:
Recompile with -Xlint:unchecked for details.
[INFO] 
[INFO] --- maven-resources-plugin:2.6:testResources (default-testResources) @ hive-common
---
[INFO] Using 'UTF-8' encoding to copy filtered resources.
[INFO] Copying 4 resources
[INFO] Copying 3 resources
[INFO] 
[INFO] --- maven-antrun-plugin:1.7:run (setup-test-dirs) @ hive-common ---
[INFO] Executing tasks

main:
    [mkdir] Created dir: /data/hive-ptest/working/apache-git-parquet-source/common/target/tmp
    [mkdir] Created dir: /data/hive-ptest/working/apache-git-parquet-source/common/target/warehouse
    [mkdir] Created dir: /data/hive-ptest/working/apache-git-parquet-source/common/target/tmp/conf
     [copy] Copying 11 files to /data/hive-ptest/working/apache-git-parquet-source/common/target/tmp/conf
[INFO] Executed tasks
[INFO] 
[INFO] --- maven-compiler-plugin:3.1:testCompile (default-testCompile) @ hive-common ---
[INFO] Compiling 20 source files to /data/hive-ptest/working/apache-git-parquet-source/common/target/test-classes
[WARNING] /data/hive-ptest/working/apache-git-parquet-source/common/src/test/org/apache/hadoop/hive/common/TestValidReadTxnList.java:
/data/hive-ptest/working/apache-git-parquet-source/common/src/test/org/apache/hadoop/hive/common/TestValidReadTxnList.java
uses or overrides a deprecated API.
[WARNING] /data/hive-ptest/working/apache-git-parquet-source/common/src/test/org/apache/hadoop/hive/common/TestValidReadTxnList.java:
Recompile with -Xlint:deprecation for details.
[INFO] 
[INFO] --- maven-surefire-plugin:2.16:test (default-test) @ hive-common ---
[INFO] Tests are skipped.
[INFO] 
[INFO] --- maven-jar-plugin:2.2:jar (default-jar) @ hive-common ---
[INFO] Building jar: /data/hive-ptest/working/apache-git-parquet-source/common/target/hive-common-1.3.0-SNAPSHOT.jar
[INFO] 
[INFO] --- maven-site-plugin:3.3:attach-descriptor (attach-descriptor) @ hive-common ---
[INFO] 
[INFO] --- maven-install-plugin:2.4:install (default-install) @ hive-common ---
[INFO] Installing /data/hive-ptest/working/apache-git-parquet-source/common/target/hive-common-1.3.0-SNAPSHOT.jar
to /data/hive-ptest/working/maven/org/apache/hive/hive-common/1.3.0-SNAPSHOT/hive-common-1.3.0-SNAPSHOT.jar
[INFO] Installing /data/hive-ptest/working/apache-git-parquet-source/common/pom.xml to /data/hive-ptest/working/maven/org/apache/hive/hive-common/1.3.0-SNAPSHOT/hive-common-1.3.0-SNAPSHOT.pom
[INFO]                                                                         
[INFO] ------------------------------------------------------------------------
[INFO] Building Hive Serde 1.3.0-SNAPSHOT
[INFO] ------------------------------------------------------------------------
Downloading: http://repository.apache.org/snapshots/org/apache/parquet/parquet-hadoop-bundle/1.8.0rc2-SNAPSHOT/maven-metadata.xml
Downloading: http://repository.apache.org/snapshots/org/apache/parquet/parquet-hadoop-bundle/1.8.0rc2-SNAPSHOT/parquet-hadoop-bundle-1.8.0rc2-SNAPSHOT.pom
[WARNING] The POM for org.apache.parquet:parquet-hadoop-bundle:jar:1.8.0rc2-SNAPSHOT is missing,
no dependency information available
Downloading: http://repository.apache.org/snapshots/org/apache/parquet/parquet-hadoop-bundle/1.8.0rc2-SNAPSHOT/parquet-hadoop-bundle-1.8.0rc2-SNAPSHOT.jar
[INFO] ------------------------------------------------------------------------
[INFO] Reactor Summary:
[INFO] 
[INFO] Hive .............................................. SUCCESS [14.357s]
[INFO] Hive Shims Common ................................. SUCCESS [12.651s]
[INFO] Hive Shims 0.20S .................................. SUCCESS [3.050s]
[INFO] Hive Shims 0.23 ................................... SUCCESS [11.427s]
[INFO] Hive Shims Scheduler .............................. SUCCESS [2.865s]
[INFO] Hive Shims ........................................ SUCCESS [2.560s]
[INFO] Hive Common ....................................... SUCCESS [15.298s]
[INFO] Hive Serde ........................................ FAILURE [2.468s]
[INFO] Hive Metastore .................................... SKIPPED
[INFO] Hive Ant Utilities ................................ SKIPPED
[INFO] Spark Remote Client ............................... SKIPPED
[INFO] Hive Query Language ............................... SKIPPED
[INFO] Hive Service ...................................... SKIPPED
[INFO] Hive Accumulo Handler ............................. SKIPPED
[INFO] Hive JDBC ......................................... SKIPPED
[INFO] Hive Beeline ...................................... SKIPPED
[INFO] Hive CLI .......................................... SKIPPED
[INFO] Hive Contrib ...................................... SKIPPED
[INFO] Hive HBase Handler ................................ SKIPPED
[INFO] Hive HCatalog ..................................... SKIPPED
[INFO] Hive HCatalog Core ................................ SKIPPED
[INFO] Hive HCatalog Pig Adapter ......................... SKIPPED
[INFO] Hive HCatalog Server Extensions ................... SKIPPED
[INFO] Hive HCatalog Webhcat Java Client ................. SKIPPED
[INFO] Hive HCatalog Webhcat ............................. SKIPPED
[INFO] Hive HCatalog Streaming ........................... SKIPPED
[INFO] Hive HWI .......................................... SKIPPED
[INFO] Hive ODBC ......................................... SKIPPED
[INFO] Hive Shims Aggregator ............................. SKIPPED
[INFO] Hive TestUtils .................................... SKIPPED
[INFO] Hive Packaging .................................... SKIPPED
[INFO] ------------------------------------------------------------------------
[INFO] BUILD FAILURE
[INFO] ------------------------------------------------------------------------
[INFO] Total time: 1:07.523s
[INFO] Finished at: Wed Jun 10 09:19:53 EDT 2015
[INFO] Final Memory: 49M/117M
[INFO] ------------------------------------------------------------------------
[ERROR] Failed to execute goal on project hive-serde: Could not resolve dependencies for project
org.apache.hive:hive-serde:jar:1.3.0-SNAPSHOT: Could not find artifact org.apache.parquet:parquet-hadoop-bundle:jar:1.8.0rc2-SNAPSHOT
in apache.snapshots (http://repository.apache.org/snapshots) -> [Help 1]
[ERROR] 
[ERROR] To see the full stack trace of the errors, re-run Maven with the -e switch.
[ERROR] Re-run Maven using the -X switch to enable full debug logging.
[ERROR] 
[ERROR] For more information about the errors and possible solutions, please read the following
articles:
[ERROR] [Help 1] http://cwiki.apache.org/confluence/display/MAVEN/DependencyResolutionException
[ERROR] 
[ERROR] After correcting the problems, you can resume the build with the command
[ERROR]   mvn <goals> -rf :hive-serde
+ exit 1
'
{noformat}

This message is automatically generated.

ATTACHMENT ID: 12738821 - PreCommit-HIVE-PARQUET-Build

> Parquet: Bump the parquet version up to 1.8.0rc2-SNAPSHOT
> ---------------------------------------------------------
>
>                 Key: HIVE-10975
>                 URL: https://issues.apache.org/jira/browse/HIVE-10975
>             Project: Hive
>          Issue Type: Sub-task
>            Reporter: Ferdinand Xu
>            Assignee: Ferdinand Xu
>            Priority: Minor
>         Attachments: HIVE-10975-parquet.patch, HIVE-10975.1-parquet.patch
>
>
> There are lots of changes since parquet's graduation.



--
This message was sent by Atlassian JIRA
(v6.3.4#6332)

Mime
View raw message