hive-issues mailing list archives

Site index · List index
Message view « Date » · « Thread »
Top « Date » · « Thread »
From "Hive QA (JIRA)" <j...@apache.org>
Subject [jira] [Commented] (HIVE-9625) Delegation tokens for HMS are not renewed
Date Sun, 28 Jun 2015 09:42:04 GMT

    [ https://issues.apache.org/jira/browse/HIVE-9625?page=com.atlassian.jira.plugin.system.issuetabpanels:comment-tabpanel&focusedCommentId=14604605#comment-14604605
] 

Hive QA commented on HIVE-9625:
-------------------------------



{color:red}Overall{color}: -1 no tests executed

Here are the results of testing the latest attachment:
https://issues.apache.org/jira/secure/attachment/12742370/HIVE-9625.1.patch

Test results: http://ec2-174-129-184-35.compute-1.amazonaws.com/jenkins/job/PreCommit-HIVE-TRUNK-Build/4423/testReport
Console output: http://ec2-174-129-184-35.compute-1.amazonaws.com/jenkins/job/PreCommit-HIVE-TRUNK-Build/4423/console
Test logs: http://ec2-174-129-184-35.compute-1.amazonaws.com/logs/PreCommit-HIVE-TRUNK-Build-4423/

Messages:
{noformat}
**** This message was trimmed, see log for full details ****
[INFO] Excluding org.apache.hadoop:hadoop-yarn-common:jar:2.4.0 from the shaded jar.
[INFO] Excluding com.google.inject.extensions:guice-servlet:jar:3.0 from the shaded jar.
[INFO] Excluding com.google.inject:guice:jar:3.0 from the shaded jar.
[INFO] Excluding javax.inject:javax.inject:jar:1 from the shaded jar.
[INFO] Excluding aopalliance:aopalliance:jar:1.0 from the shaded jar.
[INFO] Excluding com.sun.jersey.contribs:jersey-guice:jar:1.9 from the shaded jar.
[INFO] Excluding org.apache.commons:commons-collections4:jar:4.0 from the shaded jar.
[INFO] Excluding org.apache.tez:tez-runtime-library:jar:0.5.2 from the shaded jar.
[INFO] Excluding org.apache.tez:tez-common:jar:0.5.2 from the shaded jar.
[INFO] Excluding org.apache.tez:tez-runtime-internals:jar:0.5.2 from the shaded jar.
[INFO] Excluding org.apache.tez:tez-mapreduce:jar:0.5.2 from the shaded jar.
[INFO] Excluding commons-collections:commons-collections:jar:3.2.1 from the shaded jar.
[INFO] Excluding org.apache.spark:spark-core_2.10:jar:1.3.1 from the shaded jar.
[INFO] Excluding com.twitter:chill_2.10:jar:0.5.0 from the shaded jar.
[INFO] Excluding com.twitter:chill-java:jar:0.5.0 from the shaded jar.
[INFO] Excluding org.apache.hadoop:hadoop-client:jar:1.2.1 from the shaded jar.
[INFO] Excluding org.apache.spark:spark-network-common_2.10:jar:1.3.1 from the shaded jar.
[INFO] Excluding org.apache.spark:spark-network-shuffle_2.10:jar:1.3.1 from the shaded jar.
[INFO] Excluding net.java.dev.jets3t:jets3t:jar:0.7.1 from the shaded jar.
[INFO] Excluding org.apache.curator:curator-recipes:jar:2.6.0 from the shaded jar.
[INFO] Excluding org.eclipse.jetty.orbit:javax.servlet:jar:3.0.0.v201112011016 from the shaded
jar.
[INFO] Excluding org.apache.commons:commons-math3:jar:3.1.1 from the shaded jar.
[INFO] Excluding org.slf4j:jul-to-slf4j:jar:1.7.10 from the shaded jar.
[INFO] Excluding org.slf4j:jcl-over-slf4j:jar:1.7.10 from the shaded jar.
[INFO] Excluding com.ning:compress-lzf:jar:1.0.0 from the shaded jar.
[INFO] Excluding net.jpountz.lz4:lz4:jar:1.2.0 from the shaded jar.
[INFO] Excluding org.roaringbitmap:RoaringBitmap:jar:0.4.5 from the shaded jar.
[INFO] Excluding commons-net:commons-net:jar:2.2 from the shaded jar.
[INFO] Excluding org.spark-project.akka:akka-remote_2.10:jar:2.3.4-spark from the shaded jar.
[INFO] Excluding org.spark-project.akka:akka-actor_2.10:jar:2.3.4-spark from the shaded jar.
[INFO] Excluding com.typesafe:config:jar:1.2.1 from the shaded jar.
[INFO] Excluding org.spark-project.protobuf:protobuf-java:jar:2.5.0-spark from the shaded
jar.
[INFO] Excluding org.uncommons.maths:uncommons-maths:jar:1.2.2a from the shaded jar.
[INFO] Excluding org.spark-project.akka:akka-slf4j_2.10:jar:2.3.4-spark from the shaded jar.
[INFO] Excluding org.scala-lang:scala-library:jar:2.10.4 from the shaded jar.
[INFO] Excluding org.json4s:json4s-jackson_2.10:jar:3.2.10 from the shaded jar.
[INFO] Excluding org.json4s:json4s-core_2.10:jar:3.2.10 from the shaded jar.
[INFO] Excluding org.json4s:json4s-ast_2.10:jar:3.2.10 from the shaded jar.
[INFO] Excluding org.scala-lang:scalap:jar:2.10.0 from the shaded jar.
[INFO] Excluding org.scala-lang:scala-compiler:jar:2.10.0 from the shaded jar.
[INFO] Excluding org.apache.mesos:mesos:jar:shaded-protobuf:0.21.0 from the shaded jar.
[INFO] Excluding com.clearspring.analytics:stream:jar:2.7.0 from the shaded jar.
[INFO] Excluding io.dropwizard.metrics:metrics-graphite:jar:3.1.0 from the shaded jar.
[INFO] Excluding com.fasterxml.jackson.module:jackson-module-scala_2.10:jar:2.4.4 from the
shaded jar.
[INFO] Excluding org.scala-lang:scala-reflect:jar:2.10.4 from the shaded jar.
[INFO] Excluding oro:oro:jar:2.0.8 from the shaded jar.
[INFO] Excluding org.tachyonproject:tachyon-client:jar:0.5.0 from the shaded jar.
[INFO] Excluding org.tachyonproject:tachyon:jar:0.5.0 from the shaded jar.
[INFO] Excluding org.spark-project:pyrolite:jar:2.0.1 from the shaded jar.
[INFO] Excluding net.sf.py4j:py4j:jar:0.8.2.1 from the shaded jar.
[INFO] Excluding org.spark-project.spark:unused:jar:1.0.0 from the shaded jar.
[INFO] Excluding org.apache.hadoop:hadoop-core:jar:1.2.1 from the shaded jar.
[INFO] Excluding xmlenc:xmlenc:jar:0.52 from the shaded jar.
[INFO] Excluding com.sun.jersey:jersey-core:jar:1.14 from the shaded jar.
[INFO] Excluding com.sun.jersey:jersey-json:jar:1.14 from the shaded jar.
[INFO] Excluding org.codehaus.jettison:jettison:jar:1.1 from the shaded jar.
[INFO] Excluding com.sun.xml.bind:jaxb-impl:jar:2.2.3-1 from the shaded jar.
[INFO] Excluding org.codehaus.jackson:jackson-jaxrs:jar:1.9.2 from the shaded jar.
[INFO] Excluding org.codehaus.jackson:jackson-xc:jar:1.9.2 from the shaded jar.
[INFO] Excluding com.sun.jersey:jersey-server:jar:1.14 from the shaded jar.
[INFO] Excluding asm:asm:jar:3.1 from the shaded jar.
[INFO] Excluding commons-configuration:commons-configuration:jar:1.6 from the shaded jar.
[INFO] Excluding commons-digester:commons-digester:jar:1.8 from the shaded jar.
[INFO] Excluding commons-beanutils:commons-beanutils:jar:1.7.0 from the shaded jar.
[INFO] Excluding commons-beanutils:commons-beanutils-core:jar:1.8.0 from the shaded jar.
[INFO] Excluding org.mortbay.jetty:jetty:jar:6.1.26 from the shaded jar.
[INFO] Excluding org.mortbay.jetty:servlet-api:jar:2.5-20081211 from the shaded jar.
[INFO] Excluding org.mortbay.jetty:jetty-util:jar:6.1.26 from the shaded jar.
[INFO] Excluding tomcat:jasper-runtime:jar:5.5.12 from the shaded jar.
[INFO] Excluding tomcat:jasper-compiler:jar:5.5.12 from the shaded jar.
[INFO] Excluding org.mortbay.jetty:jsp-api-2.1:jar:6.1.14 from the shaded jar.
[INFO] Excluding org.mortbay.jetty:servlet-api-2.5:jar:6.1.14 from the shaded jar.
[INFO] Excluding org.mortbay.jetty:jsp-2.1:jar:6.1.14 from the shaded jar.
[INFO] Excluding ant:ant:jar:1.6.5 from the shaded jar.
[INFO] Excluding commons-el:commons-el:jar:1.0 from the shaded jar.
[INFO] Excluding hsqldb:hsqldb:jar:1.8.0.10 from the shaded jar.
[INFO] Excluding org.eclipse.jdt:core:jar:3.1.1 from the shaded jar.
[INFO] Excluding org.apache.hadoop:hadoop-tools:jar:1.2.1 from the shaded jar.
[INFO] Excluding org.slf4j:slf4j-api:jar:1.7.5 from the shaded jar.
[INFO] Excluding org.slf4j:slf4j-log4j12:jar:1.7.5 from the shaded jar.
[INFO] Replacing original artifact with shaded artifact.
[INFO] Replacing /data/hive-ptest/working/apache-github-source-source/ql/target/hive-exec-2.0.0-SNAPSHOT.jar
with /data/hive-ptest/working/apache-github-source-source/ql/target/hive-exec-2.0.0-SNAPSHOT-shaded.jar
[INFO] Dependency-reduced POM written at: /data/hive-ptest/working/apache-github-source-source/ql/dependency-reduced-pom.xml
[INFO] Dependency-reduced POM written at: /data/hive-ptest/working/apache-github-source-source/ql/dependency-reduced-pom.xml
[INFO] 
[INFO] --- maven-install-plugin:2.4:install (default-install) @ hive-exec ---
[INFO] Installing /data/hive-ptest/working/apache-github-source-source/ql/target/hive-exec-2.0.0-SNAPSHOT.jar
to /home/hiveptest/.m2/repository/org/apache/hive/hive-exec/2.0.0-SNAPSHOT/hive-exec-2.0.0-SNAPSHOT.jar
[INFO] Installing /data/hive-ptest/working/apache-github-source-source/ql/dependency-reduced-pom.xml
to /home/hiveptest/.m2/repository/org/apache/hive/hive-exec/2.0.0-SNAPSHOT/hive-exec-2.0.0-SNAPSHOT.pom
[INFO] Installing /data/hive-ptest/working/apache-github-source-source/ql/target/hive-exec-2.0.0-SNAPSHOT-tests.jar
to /home/hiveptest/.m2/repository/org/apache/hive/hive-exec/2.0.0-SNAPSHOT/hive-exec-2.0.0-SNAPSHOT-tests.jar
[INFO] Installing /data/hive-ptest/working/apache-github-source-source/ql/target/hive-exec-2.0.0-SNAPSHOT-core.jar
to /home/hiveptest/.m2/repository/org/apache/hive/hive-exec/2.0.0-SNAPSHOT/hive-exec-2.0.0-SNAPSHOT-core.jar
[INFO]                                                                         
[INFO] ------------------------------------------------------------------------
[INFO] Building Hive Service 2.0.0-SNAPSHOT
[INFO] ------------------------------------------------------------------------
[INFO] 
[INFO] --- maven-clean-plugin:2.5:clean (default-clean) @ hive-service ---
[INFO] Deleting /data/hive-ptest/working/apache-github-source-source/service/target
[INFO] Deleting /data/hive-ptest/working/apache-github-source-source/service (includes = [datanucleus.log,
derby.log], excludes = [])
[INFO] 
[INFO] --- maven-enforcer-plugin:1.3.1:enforce (enforce-no-snapshots) @ hive-service ---
[INFO] 
[INFO] --- build-helper-maven-plugin:1.8:add-source (add-source) @ hive-service ---
[INFO] Source directory: /data/hive-ptest/working/apache-github-source-source/service/src/model
added.
[INFO] Source directory: /data/hive-ptest/working/apache-github-source-source/service/src/gen/thrift/gen-javabean
added.
[INFO] 
[INFO] --- maven-remote-resources-plugin:1.5:process (default) @ hive-service ---
[INFO] 
[INFO] --- maven-resources-plugin:2.6:resources (default-resources) @ hive-service ---
[INFO] Using 'UTF-8' encoding to copy filtered resources.
[INFO] skip non existing resourceDirectory /data/hive-ptest/working/apache-github-source-source/service/src/main/resources
[INFO] Copying 3 resources
[INFO] 
[INFO] --- maven-antrun-plugin:1.7:run (define-classpath) @ hive-service ---
[INFO] Executing tasks

main:
[INFO] Executed tasks
[INFO] 
[INFO] --- maven-compiler-plugin:3.1:compile (default-compile) @ hive-service ---
[INFO] Compiling 177 source files to /data/hive-ptest/working/apache-github-source-source/service/target/classes
[INFO] -------------------------------------------------------------
[WARNING] COMPILATION WARNING : 
[INFO] -------------------------------------------------------------
[WARNING] /data/hive-ptest/working/apache-github-source-source/service/src/java/org/apache/hive/service/cli/operation/SQLOperation.java:
Some input files use or override a deprecated API.
[WARNING] /data/hive-ptest/working/apache-github-source-source/service/src/java/org/apache/hive/service/cli/operation/SQLOperation.java:
Recompile with -Xlint:deprecation for details.
[WARNING] /data/hive-ptest/working/apache-github-source-source/service/src/gen/thrift/gen-javabean/org/apache/hive/service/cli/thrift/TByteColumn.java:
Some input files use unchecked or unsafe operations.
[WARNING] /data/hive-ptest/working/apache-github-source-source/service/src/gen/thrift/gen-javabean/org/apache/hive/service/cli/thrift/TByteColumn.java:
Recompile with -Xlint:unchecked for details.
[INFO] 4 warnings 
[INFO] -------------------------------------------------------------
[INFO] -------------------------------------------------------------
[ERROR] COMPILATION ERROR : 
[INFO] -------------------------------------------------------------
[ERROR] /data/hive-ptest/working/apache-github-source-source/service/src/java/org/apache/hive/service/cli/session/HiveSessionImplwithUGI.java:[150,73]
cannot find symbol
  symbol:   method getUsername()
  location: class org.apache.hive.service.cli.session.HiveSessionImplwithUGI
[ERROR] /data/hive-ptest/working/apache-github-source-source/service/src/java/org/apache/hive/service/cli/session/HiveSessionImplwithUGI.java:[150,88]
cannot find symbol
  symbol:   method getUsername()
  location: class org.apache.hive.service.cli.session.HiveSessionImplwithUGI
[INFO] 2 errors 
[INFO] -------------------------------------------------------------
[INFO] ------------------------------------------------------------------------
[INFO] Reactor Summary:
[INFO] 
[INFO] Hive .............................................. SUCCESS [15.086s]
[INFO] Hive Shims Common ................................. SUCCESS [12.831s]
[INFO] Hive Shims 0.20S .................................. SUCCESS [3.294s]
[INFO] Hive Shims 0.23 ................................... SUCCESS [11.064s]
[INFO] Hive Shims Scheduler .............................. SUCCESS [1.999s]
[INFO] Hive Shims ........................................ SUCCESS [2.147s]
[INFO] Hive Common ....................................... SUCCESS [16.677s]
[INFO] Hive Serde ........................................ SUCCESS [17.541s]
[INFO] Hive Metastore .................................... SUCCESS [37.672s]
[INFO] Hive Ant Utilities ................................ SUCCESS [2.014s]
[INFO] Spark Remote Client ............................... SUCCESS [21.695s]
[INFO] Hive Query Language ............................... SUCCESS [2:49.986s]
[INFO] Hive Service ...................................... FAILURE [9.339s]
[INFO] Hive Accumulo Handler ............................. SKIPPED
[INFO] Hive JDBC ......................................... SKIPPED
[INFO] Hive Beeline ...................................... SKIPPED
[INFO] Hive CLI .......................................... SKIPPED
[INFO] Hive Contrib ...................................... SKIPPED
[INFO] Hive HBase Handler ................................ SKIPPED
[INFO] Hive HCatalog ..................................... SKIPPED
[INFO] Hive HCatalog Core ................................ SKIPPED
[INFO] Hive HCatalog Pig Adapter ......................... SKIPPED
[INFO] Hive HCatalog Server Extensions ................... SKIPPED
[INFO] Hive HCatalog Webhcat Java Client ................. SKIPPED
[INFO] Hive HCatalog Webhcat ............................. SKIPPED
[INFO] Hive HCatalog Streaming ........................... SKIPPED
[INFO] Hive HWI .......................................... SKIPPED
[INFO] Hive ODBC ......................................... SKIPPED
[INFO] Hive Shims Aggregator ............................. SKIPPED
[INFO] Hive TestUtils .................................... SKIPPED
[INFO] Hive Packaging .................................... SKIPPED
[INFO] ------------------------------------------------------------------------
[INFO] BUILD FAILURE
[INFO] ------------------------------------------------------------------------
[INFO] Total time: 5:24.160s
[INFO] Finished at: Sun Jun 28 05:41:06 EDT 2015
[INFO] Final Memory: 171M/752M
[INFO] ------------------------------------------------------------------------
[ERROR] Failed to execute goal org.apache.maven.plugins:maven-compiler-plugin:3.1:compile
(default-compile) on project hive-service: Compilation failure: Compilation failure:
[ERROR] /data/hive-ptest/working/apache-github-source-source/service/src/java/org/apache/hive/service/cli/session/HiveSessionImplwithUGI.java:[150,73]
cannot find symbol
[ERROR] symbol:   method getUsername()
[ERROR] location: class org.apache.hive.service.cli.session.HiveSessionImplwithUGI
[ERROR] /data/hive-ptest/working/apache-github-source-source/service/src/java/org/apache/hive/service/cli/session/HiveSessionImplwithUGI.java:[150,88]
cannot find symbol
[ERROR] symbol:   method getUsername()
[ERROR] location: class org.apache.hive.service.cli.session.HiveSessionImplwithUGI
[ERROR] -> [Help 1]
[ERROR] 
[ERROR] To see the full stack trace of the errors, re-run Maven with the -e switch.
[ERROR] Re-run Maven using the -X switch to enable full debug logging.
[ERROR] 
[ERROR] For more information about the errors and possible solutions, please read the following
articles:
[ERROR] [Help 1] http://cwiki.apache.org/confluence/display/MAVEN/MojoFailureException
[ERROR] 
[ERROR] After correcting the problems, you can resume the build with the command
[ERROR]   mvn <goals> -rf :hive-service
+ exit 1
'
{noformat}

This message is automatically generated.

ATTACHMENT ID: 12742370 - PreCommit-HIVE-TRUNK-Build

> Delegation tokens for HMS are not renewed
> -----------------------------------------
>
>                 Key: HIVE-9625
>                 URL: https://issues.apache.org/jira/browse/HIVE-9625
>             Project: Hive
>          Issue Type: Bug
>          Components: HiveServer2
>            Reporter: Brock Noland
>            Assignee: Brock Noland
>         Attachments: HIVE-9625-branch-1.patch, HIVE-9625.1.patch, HIVE-9625.1.patch,
HIVE-9625.1.patch
>
>
> AFAICT the delegation tokens stored in [HiveSessionImplwithUGI |https://github.com/apache/hive/blob/trunk/service/src/java/org/apache/hive/service/cli/session/HiveSessionImplwithUGI.java#L45]
for HMS + Impersonation are never renewed.



--
This message was sent by Atlassian JIRA
(v6.3.4#6332)

Mime
View raw message