hive-issues mailing list archives

Site index · List index
Message view « Date » · « Thread »
Top « Date » · « Thread »
From "Hive QA (JIRA)" <j...@apache.org>
Subject [jira] [Commented] (HIVE-10629) Dropping table in an encrypted zone does not drop warehouse directory
Date Fri, 15 May 2015 05:55:02 GMT

    [ https://issues.apache.org/jira/browse/HIVE-10629?page=com.atlassian.jira.plugin.system.issuetabpanels:comment-tabpanel&focusedCommentId=14544973#comment-14544973
] 

Hive QA commented on HIVE-10629:
--------------------------------



{color:red}Overall{color}: -1 no tests executed

Here are the results of testing the latest attachment:
https://issues.apache.org/jira/secure/attachment/12733052/HIVE-10629.patch

Test results: http://ec2-174-129-184-35.compute-1.amazonaws.com/jenkins/job/PreCommit-HIVE-TRUNK-Build/3903/testReport
Console output: http://ec2-174-129-184-35.compute-1.amazonaws.com/jenkins/job/PreCommit-HIVE-TRUNK-Build/3903/console
Test logs: http://ec2-174-129-184-35.compute-1.amazonaws.com/logs/PreCommit-HIVE-TRUNK-Build-3903/

Messages:
{noformat}
**** This message was trimmed, see log for full details ****
[INFO] 
[INFO] --- maven-compiler-plugin:3.1:testCompile (default-testCompile) @ hive-common ---
[INFO] Compiling 20 source files to /data/hive-ptest/working/apache-github-source-source/common/target/test-classes
[WARNING] /data/hive-ptest/working/apache-github-source-source/common/src/test/org/apache/hadoop/hive/common/TestValidReadTxnList.java:
/data/hive-ptest/working/apache-github-source-source/common/src/test/org/apache/hadoop/hive/common/TestValidReadTxnList.java
uses or overrides a deprecated API.
[WARNING] /data/hive-ptest/working/apache-github-source-source/common/src/test/org/apache/hadoop/hive/common/TestValidReadTxnList.java:
Recompile with -Xlint:deprecation for details.
[INFO] 
[INFO] --- maven-surefire-plugin:2.16:test (default-test) @ hive-common ---
[INFO] Tests are skipped.
[INFO] 
[INFO] --- maven-jar-plugin:2.2:jar (default-jar) @ hive-common ---
[INFO] Building jar: /data/hive-ptest/working/apache-github-source-source/common/target/hive-common-1.3.0-SNAPSHOT.jar
[INFO] 
[INFO] --- maven-site-plugin:3.3:attach-descriptor (attach-descriptor) @ hive-common ---
[INFO] 
[INFO] --- maven-install-plugin:2.4:install (default-install) @ hive-common ---
[INFO] Installing /data/hive-ptest/working/apache-github-source-source/common/target/hive-common-1.3.0-SNAPSHOT.jar
to /home/hiveptest/.m2/repository/org/apache/hive/hive-common/1.3.0-SNAPSHOT/hive-common-1.3.0-SNAPSHOT.jar
[INFO] Installing /data/hive-ptest/working/apache-github-source-source/common/pom.xml to /home/hiveptest/.m2/repository/org/apache/hive/hive-common/1.3.0-SNAPSHOT/hive-common-1.3.0-SNAPSHOT.pom
[INFO]                                                                         
[INFO] ------------------------------------------------------------------------
[INFO] Building Hive Serde 1.3.0-SNAPSHOT
[INFO] ------------------------------------------------------------------------
[INFO] 
[INFO] --- maven-clean-plugin:2.5:clean (default-clean) @ hive-serde ---
[INFO] Deleting /data/hive-ptest/working/apache-github-source-source/serde/target
[INFO] Deleting /data/hive-ptest/working/apache-github-source-source/serde (includes = [datanucleus.log,
derby.log], excludes = [])
[INFO] 
[INFO] --- maven-enforcer-plugin:1.3.1:enforce (enforce-no-snapshots) @ hive-serde ---
[INFO] 
[INFO] --- build-helper-maven-plugin:1.8:add-source (add-source) @ hive-serde ---
[INFO] Source directory: /data/hive-ptest/working/apache-github-source-source/serde/src/gen/protobuf/gen-java
added.
[INFO] Source directory: /data/hive-ptest/working/apache-github-source-source/serde/src/gen/thrift/gen-javabean
added.
[INFO] 
[INFO] --- maven-remote-resources-plugin:1.5:process (default) @ hive-serde ---
[INFO] 
[INFO] --- maven-resources-plugin:2.6:resources (default-resources) @ hive-serde ---
[INFO] Using 'UTF-8' encoding to copy filtered resources.
[INFO] skip non existing resourceDirectory /data/hive-ptest/working/apache-github-source-source/serde/src/main/resources
[INFO] Copying 3 resources
[INFO] 
[INFO] --- maven-antrun-plugin:1.7:run (define-classpath) @ hive-serde ---
[INFO] Executing tasks

main:
[INFO] Executed tasks
[INFO] 
[INFO] --- maven-compiler-plugin:3.1:compile (default-compile) @ hive-serde ---
[INFO] Compiling 407 source files to /data/hive-ptest/working/apache-github-source-source/serde/target/classes
[WARNING] /data/hive-ptest/working/apache-github-source-source/serde/src/java/org/apache/hadoop/hive/serde2/SerDe.java:
Some input files use or override a deprecated API.
[WARNING] /data/hive-ptest/working/apache-github-source-source/serde/src/java/org/apache/hadoop/hive/serde2/SerDe.java:
Recompile with -Xlint:deprecation for details.
[WARNING] /data/hive-ptest/working/apache-github-source-source/serde/src/java/org/apache/hadoop/hive/serde2/objectinspector/StandardStructObjectInspector.java:
Some input files use unchecked or unsafe operations.
[WARNING] /data/hive-ptest/working/apache-github-source-source/serde/src/java/org/apache/hadoop/hive/serde2/objectinspector/StandardStructObjectInspector.java:
Recompile with -Xlint:unchecked for details.
[INFO] 
[INFO] --- maven-resources-plugin:2.6:testResources (default-testResources) @ hive-serde ---
[INFO] Using 'UTF-8' encoding to copy filtered resources.
[INFO] Copying 2 resources
[INFO] Copying 3 resources
[INFO] 
[INFO] --- maven-antrun-plugin:1.7:run (setup-test-dirs) @ hive-serde ---
[INFO] Executing tasks

main:
    [mkdir] Created dir: /data/hive-ptest/working/apache-github-source-source/serde/target/tmp
    [mkdir] Created dir: /data/hive-ptest/working/apache-github-source-source/serde/target/warehouse
    [mkdir] Created dir: /data/hive-ptest/working/apache-github-source-source/serde/target/tmp/conf
     [copy] Copying 11 files to /data/hive-ptest/working/apache-github-source-source/serde/target/tmp/conf
[INFO] Executed tasks
[INFO] 
[INFO] --- maven-compiler-plugin:3.1:testCompile (default-testCompile) @ hive-serde ---
[INFO] Compiling 53 source files to /data/hive-ptest/working/apache-github-source-source/serde/target/test-classes
[WARNING] /data/hive-ptest/working/apache-github-source-source/serde/src/test/org/apache/hadoop/hive/serde2/columnar/TestLazyBinaryColumnarSerDe.java:
Some input files use or override a deprecated API.
[WARNING] /data/hive-ptest/working/apache-github-source-source/serde/src/test/org/apache/hadoop/hive/serde2/columnar/TestLazyBinaryColumnarSerDe.java:
Recompile with -Xlint:deprecation for details.
[WARNING] /data/hive-ptest/working/apache-github-source-source/serde/src/test/org/apache/hadoop/hive/serde2/lazy/TestLazyArrayMapStruct.java:
Some input files use unchecked or unsafe operations.
[WARNING] /data/hive-ptest/working/apache-github-source-source/serde/src/test/org/apache/hadoop/hive/serde2/lazy/TestLazyArrayMapStruct.java:
Recompile with -Xlint:unchecked for details.
[INFO] 
[INFO] --- maven-surefire-plugin:2.16:test (default-test) @ hive-serde ---
[INFO] Tests are skipped.
[INFO] 
[INFO] --- maven-jar-plugin:2.2:jar (default-jar) @ hive-serde ---
[INFO] Building jar: /data/hive-ptest/working/apache-github-source-source/serde/target/hive-serde-1.3.0-SNAPSHOT.jar
[INFO] 
[INFO] --- maven-site-plugin:3.3:attach-descriptor (attach-descriptor) @ hive-serde ---
[INFO] 
[INFO] --- maven-install-plugin:2.4:install (default-install) @ hive-serde ---
[INFO] Installing /data/hive-ptest/working/apache-github-source-source/serde/target/hive-serde-1.3.0-SNAPSHOT.jar
to /home/hiveptest/.m2/repository/org/apache/hive/hive-serde/1.3.0-SNAPSHOT/hive-serde-1.3.0-SNAPSHOT.jar
[INFO] Installing /data/hive-ptest/working/apache-github-source-source/serde/pom.xml to /home/hiveptest/.m2/repository/org/apache/hive/hive-serde/1.3.0-SNAPSHOT/hive-serde-1.3.0-SNAPSHOT.pom
[INFO]                                                                         
[INFO] ------------------------------------------------------------------------
[INFO] Building Hive Metastore 1.3.0-SNAPSHOT
[INFO] ------------------------------------------------------------------------
[INFO] 
[INFO] --- maven-clean-plugin:2.5:clean (default-clean) @ hive-metastore ---
[INFO] Deleting /data/hive-ptest/working/apache-github-source-source/metastore/target
[INFO] Deleting /data/hive-ptest/working/apache-github-source-source/metastore (includes =
[datanucleus.log, derby.log], excludes = [])
[INFO] 
[INFO] --- maven-enforcer-plugin:1.3.1:enforce (enforce-no-snapshots) @ hive-metastore ---
[INFO] 
[INFO] --- build-helper-maven-plugin:1.8:add-source (add-source) @ hive-metastore ---
[INFO] Source directory: /data/hive-ptest/working/apache-github-source-source/metastore/src/model
added.
[INFO] Source directory: /data/hive-ptest/working/apache-github-source-source/metastore/src/gen/thrift/gen-javabean
added.
[INFO] 
[INFO] --- antlr3-maven-plugin:3.4:antlr (default) @ hive-metastore ---
[INFO] ANTLR: Processing source directory /data/hive-ptest/working/apache-github-source-source/metastore/src/java
ANTLR Parser Generator  Version 3.4
org/apache/hadoop/hive/metastore/parser/Filter.g
[INFO] 
[INFO] --- maven-remote-resources-plugin:1.5:process (default) @ hive-metastore ---
[INFO] 
[INFO] --- maven-resources-plugin:2.6:resources (default-resources) @ hive-metastore ---
[INFO] Using 'UTF-8' encoding to copy filtered resources.
[INFO] Copying 1 resource
[INFO] Copying 3 resources
[INFO] 
[INFO] --- maven-antrun-plugin:1.7:run (define-classpath) @ hive-metastore ---
[INFO] Executing tasks

main:
[INFO] Executed tasks
[INFO] 
[INFO] --- maven-compiler-plugin:3.1:compile (default-compile) @ hive-metastore ---
[INFO] Compiling 245 source files to /data/hive-ptest/working/apache-github-source-source/metastore/target/classes
[INFO] -------------------------------------------------------------
[WARNING] COMPILATION WARNING : 
[INFO] -------------------------------------------------------------
[WARNING] /data/hive-ptest/working/apache-github-source-source/metastore/src/java/org/apache/hadoop/hive/metastore/MetaStoreUtils.java:
Some input files use or override a deprecated API.
[WARNING] /data/hive-ptest/working/apache-github-source-source/metastore/src/java/org/apache/hadoop/hive/metastore/MetaStoreUtils.java:
Recompile with -Xlint:deprecation for details.
[WARNING] /data/hive-ptest/working/apache-github-source-source/metastore/src/gen/thrift/gen-javabean/org/apache/hadoop/hive/metastore/api/GetOpenTxnsResponse.java:
Some input files use unchecked or unsafe operations.
[WARNING] /data/hive-ptest/working/apache-github-source-source/metastore/src/gen/thrift/gen-javabean/org/apache/hadoop/hive/metastore/api/GetOpenTxnsResponse.java:
Recompile with -Xlint:unchecked for details.
[INFO] 4 warnings 
[INFO] -------------------------------------------------------------
[INFO] -------------------------------------------------------------
[ERROR] COMPILATION ERROR : 
[INFO] -------------------------------------------------------------
[ERROR] /data/hive-ptest/working/apache-github-source-source/metastore/src/java/org/apache/hadoop/hive/metastore/HiveMetaStore.java:[58,28]
cannot find symbol
  symbol:   class CommonConfigurationKeysPublic
  location: package org.apache.hadoop.fs
[ERROR] /data/hive-ptest/working/apache-github-source-source/metastore/src/java/org/apache/hadoop/hive/metastore/HiveMetaStore.java:[1541,47]
cannot find symbol
  symbol:   variable CommonConfigurationKeysPublic
  location: class org.apache.hadoop.hive.metastore.HiveMetaStore.HMSHandler
[INFO] 2 errors 
[INFO] -------------------------------------------------------------
[INFO] ------------------------------------------------------------------------
[INFO] Reactor Summary:
[INFO] 
[INFO] Hive .............................................. SUCCESS [12.473s]
[INFO] Hive Shims Common ................................. SUCCESS [14.560s]
[INFO] Hive Shims 0.20S .................................. SUCCESS [3.943s]
[INFO] Hive Shims 0.23 ................................... SUCCESS [11.933s]
[INFO] Hive Shims Scheduler .............................. SUCCESS [2.380s]
[INFO] Hive Shims ........................................ SUCCESS [2.662s]
[INFO] Hive Common ....................................... SUCCESS [16.357s]
[INFO] Hive Serde ........................................ SUCCESS [19.209s]
[INFO] Hive Metastore .................................... FAILURE [24.135s]
[INFO] Hive Ant Utilities ................................ SKIPPED
[INFO] Spark Remote Client ............................... SKIPPED
[INFO] Hive Query Language ............................... SKIPPED
[INFO] Hive Service ...................................... SKIPPED
[INFO] Hive Accumulo Handler ............................. SKIPPED
[INFO] Hive JDBC ......................................... SKIPPED
[INFO] Hive Beeline ...................................... SKIPPED
[INFO] Hive CLI .......................................... SKIPPED
[INFO] Hive Contrib ...................................... SKIPPED
[INFO] Hive HBase Handler ................................ SKIPPED
[INFO] Hive HCatalog ..................................... SKIPPED
[INFO] Hive HCatalog Core ................................ SKIPPED
[INFO] Hive HCatalog Pig Adapter ......................... SKIPPED
[INFO] Hive HCatalog Server Extensions ................... SKIPPED
[INFO] Hive HCatalog Webhcat Java Client ................. SKIPPED
[INFO] Hive HCatalog Webhcat ............................. SKIPPED
[INFO] Hive HCatalog Streaming ........................... SKIPPED
[INFO] Hive HWI .......................................... SKIPPED
[INFO] Hive ODBC ......................................... SKIPPED
[INFO] Hive Shims Aggregator ............................. SKIPPED
[INFO] Hive TestUtils .................................... SKIPPED
[INFO] Hive Packaging .................................... SKIPPED
[INFO] ------------------------------------------------------------------------
[INFO] BUILD FAILURE
[INFO] ------------------------------------------------------------------------
[INFO] Total time: 1:51.021s
[INFO] Finished at: Fri May 15 01:54:47 EDT 2015
[INFO] Final Memory: 55M/319M
[INFO] ------------------------------------------------------------------------
[ERROR] Failed to execute goal org.apache.maven.plugins:maven-compiler-plugin:3.1:compile
(default-compile) on project hive-metastore: Compilation failure: Compilation failure:
[ERROR] /data/hive-ptest/working/apache-github-source-source/metastore/src/java/org/apache/hadoop/hive/metastore/HiveMetaStore.java:[58,28]
cannot find symbol
[ERROR] symbol:   class CommonConfigurationKeysPublic
[ERROR] location: package org.apache.hadoop.fs
[ERROR] /data/hive-ptest/working/apache-github-source-source/metastore/src/java/org/apache/hadoop/hive/metastore/HiveMetaStore.java:[1541,47]
cannot find symbol
[ERROR] symbol:   variable CommonConfigurationKeysPublic
[ERROR] location: class org.apache.hadoop.hive.metastore.HiveMetaStore.HMSHandler
[ERROR] -> [Help 1]
[ERROR] 
[ERROR] To see the full stack trace of the errors, re-run Maven with the -e switch.
[ERROR] Re-run Maven using the -X switch to enable full debug logging.
[ERROR] 
[ERROR] For more information about the errors and possible solutions, please read the following
articles:
[ERROR] [Help 1] http://cwiki.apache.org/confluence/display/MAVEN/MojoFailureException
[ERROR] 
[ERROR] After correcting the problems, you can resume the build with the command
[ERROR]   mvn <goals> -rf :hive-metastore
+ exit 1
'
{noformat}

This message is automatically generated.

ATTACHMENT ID: 12733052 - PreCommit-HIVE-TRUNK-Build

> Dropping table in an encrypted zone does not drop warehouse directory
> ---------------------------------------------------------------------
>
>                 Key: HIVE-10629
>                 URL: https://issues.apache.org/jira/browse/HIVE-10629
>             Project: Hive
>          Issue Type: Sub-task
>          Components: Security
>    Affects Versions: 1.1.0
>            Reporter: Deepesh Khandelwal
>            Assignee: Eugene Koifman
>         Attachments: HIVE-10629.patch
>
>
> Drop table in an encrypted zone removes the table but not its data. The client sees the
following on Hive CLI:
> {noformat}
> hive> drop table testtbl;
> OK
> Time taken: 0.158 seconds
> {noformat}
> On the Hive Metastore log following error is thrown:
> {noformat}
> 2015-05-05 08:55:27,665 ERROR [pool-6-thread-142]: hive.log (MetaStoreUtils.java:logAndThrowMetaException(1200))
- Got exception: java.io.IOException Failed to move to trash: hdfs://node-1.example.com:8020/apps/hive/warehouse/encdb1.db/testtbl
> java.io.IOException: Failed to move to trash: hdfs://node-1.example.com:8020/apps/hive/warehouse/encdb1.db/testtbl
>         at org.apache.hadoop.fs.TrashPolicyDefault.moveToTrash(TrashPolicyDefault.java:160)
>         at org.apache.hadoop.fs.Trash.moveToTrash(Trash.java:114)
>         at org.apache.hadoop.fs.Trash.moveToAppropriateTrash(Trash.java:95)
>         at org.apache.hadoop.hive.shims.Hadoop23Shims.moveToAppropriateTrash(Hadoop23Shims.java:270)
>         at org.apache.hadoop.hive.metastore.HiveMetaStoreFsImpl.deleteDir(HiveMetaStoreFsImpl.java:47)
>         at org.apache.hadoop.hive.metastore.Warehouse.deleteDir(Warehouse.java:229)
>         at org.apache.hadoop.hive.metastore.HiveMetaStore$HMSHandler.deleteTableData(HiveMetaStore.java:1584)
>         at org.apache.hadoop.hive.metastore.HiveMetaStore$HMSHandler.drop_table_core(HiveMetaStore.java:1552)
>         at org.apache.hadoop.hive.metastore.HiveMetaStore$HMSHandler.drop_table_with_environment_context(HiveMetaStore.java:1705)
>         at sun.reflect.GeneratedMethodAccessor57.invoke(Unknown Source)
>         at sun.reflect.DelegatingMethodAccessorImpl.invoke(DelegatingMethodAccessorImpl.java:43)
>         at java.lang.reflect.Method.invoke(Method.java:606)
>         at org.apache.hadoop.hive.metastore.RetryingHMSHandler.invoke(RetryingHMSHandler.java:107)
>         at com.sun.proxy.$Proxy13.drop_table_with_environment_context(Unknown Source)
>         at org.apache.hadoop.hive.metastore.api.ThriftHiveMetastore$Processor$drop_table_with_environment_context.getResult(ThriftHiveMetastore.java:9256)
>         ....
> {noformat}
> The client should throw the error and maybe fail the drop table call. To delete the table
data one currently has to use {{drop table testtbl purge}} which basically remove the table
data permanently skipping trash.



--
This message was sent by Atlassian JIRA
(v6.3.4#6332)

Mime
View raw message